program: Orca
programVersion: 5.0.2
elementType: O O O C C C C C C C C C C C C C C C C C C C H H H H H H H H H H H H H H H H H H H H H H H H H H H H H H H H H H
charge: 0
multiplicity: 1
keywords: wb97x-d3
keywords: def2-TZVPP
keywords: def2/J RIJCOSX
keywords: DEFGRID2
keywords: scfconv7
keywords: smallprint printgap noloewdin
keywords: NOSOSCF
formula: C19H34O3
InChI: InChI=1/C19H34O3/c1-15(2)22-18(20)14-17(4)11-8-10-16(3)12-9-13-19(5,6)21-7/h8,11,14-16H,9-10,12-13H2,1-7H3
56 atoms
O  -2.435797 3.18714 0.899603
O  4.092983 -0.706353 0.437077
O  3.497055 -0.398164 -1.697593
C  -2.898394 0.288595 1.161572
C  -2.740545 1.102416 -0.116352
C  -4.052533 -0.707983 1.113986
C  -1.795729 2.306034 -0.012913
C  -4.01755 -1.794635 0.034979
C  -2.761038 -2.683573 0.107456
C  -1.671667 2.952788 -1.394533
C  -0.413837 1.876914 0.481254
C  -5.27288 -2.655963 0.153084
C  -1.573033 -2.145785 -0.617595
C  -1.733733 4.325732 1.302076
C  -0.352198 -1.991513 -0.09951
C  0.809127 -1.462775 -0.810276
C  0.631772 -1.100385 -2.252054
C  1.946822 -1.311707 -0.103632
C  3.225837 -0.760176 -0.579514
C  5.402377 -0.170418 0.196654
C  5.364641 1.34794 0.216855
C  6.298378 -0.737837 1.279867
H  -3.081158 0.96909 1.996042
H  -1.966353 -0.232394 1.391253
H  -3.721458 1.472785 -0.434926
H  -2.381465 0.458883 -0.924948
H  -4.987415 -0.14908 0.997784
H  -4.125249 -1.203648 2.088977
H  -4.0397 -1.314808 -0.951075
H  -3.003819 -3.651285 -0.347849
H  -2.51103 -2.896771 1.151623
H  -1.2384 2.249212 -2.107067
H  -1.024377 3.831238 -1.386083
H  -2.648493 3.25725 -1.773338
H  0.316273 2.685567 0.416605
H  -0.442562 1.534562 1.516306
H  -0.030263 1.055226 -0.123232
H  -5.287777 -3.200733 1.099931
H  -5.332638 -3.390799 -0.651154
H  -6.177227 -2.04745 0.112473
H  -1.747296 -1.888502 -1.658838
H  -1.433441 4.970967 0.468037
H  -0.835888 4.095708 1.887216
H  -2.40364 4.904066 1.938489
H  -0.196253 -2.251861 0.943825
H  1.543727 -0.735617 -2.706867
H  0.283518 -1.965776 -2.818334
H  -0.135084 -0.327961 -2.351618
H  1.938471 -1.603088 0.940281
H  5.752371 -0.509192 -0.782038
H  4.999576 1.717023 1.176557
H  6.368834 1.745713 0.065949
H  4.730986 1.745072 -0.574243
H  5.974393 -0.419739 2.2717
H  7.321188 -0.390068 1.135003
H  6.309826 -1.827336 1.256717
totalener: -970.26615408 hartree
nucrepener: 1905.48391974 hartree
electener: -2875.75007382 hartree
oneelecener: -5103.00102472 hartree
twoeener: 2227.25095090 hartree
kineticenergy: 965.64807608 hartree
xcener: -96.766842641599 hartree
chargesum: -0.0000000
charge: -0.334361 -0.272405 -0.404543 -0.077708 -0.162493 -0.238749 0.315432 0.077552 -0.141307 -0.301819 -0.329843 -0.276112 -0.117711 -0.124545 -0.121809 0.013224 -0.245309 -0.163249 0.425642 0.145068 -0.260704 -0.229529 0.094112 0.058963 0.086089 0.047076 0.075936 0.074620 0.042310 0.092275 0.077864 0.084914 0.084080 0.097033 0.097206 0.101518 0.057248 0.083080 0.079929 0.083402 0.100396 0.075021 0.080424 0.109546 0.081857 0.128172 0.100308 0.064719 0.093564 0.059149 0.081127 0.080959 0.103645 0.080974 0.076642 0.091118
qa: -0.3344 -0.2724 -0.4045 -0.0777 -0.1625 -0.2387 0.3154 0.0776 -0.1413 -0.3018 -0.3298 -0.2761 -0.1177 -0.1245 -0.1218 0.0132 -0.2453 -0.1632 0.4256 0.1451 -0.2607 -0.2295 0.0941 0.0590 0.0861 0.0471 0.0759 0.0746 0.0423 0.0923 0.0779 0.0849 0.0841 0.0970 0.0972 0.1015 0.0572 0.0831 0.0799 0.0834 0.1004 0.0750 0.0804 0.1095 0.0819 0.1282 0.1003 0.0647 0.0936 0.0591 0.0811 0.0810 0.1036 0.0810 0.0766 0.0911
va: 2.0151 2.1383 2.0926 3.7906 3.7793 3.9762 3.9165 3.7139 3.9139 3.9299 3.9303 3.9441 3.8543 3.9623 3.9002 3.6542 3.9007 3.8010 4.2139 3.8550 3.9078 3.9289 1.0330 1.0135 1.0287 1.0164 1.0094 1.0110 1.0171 1.0039 1.0154 1.0035 1.0090 1.0108 1.0061 0.9992 1.0338 1.0034 1.0067 1.0079 1.0062 0.9837 0.9813 0.9962 1.0277 1.0419 0.9993 1.0001 1.0380 1.0241 1.0086 1.0092 1.0176 1.0094 1.0081 1.0112
dispcorr: -0.028174177 hartree
energy: -970.294328255521
dipole: -12.50741 12.47734 -0.03007 6.28773 -6.40492 -0.11719 3.23586 -2.87157 0.36429
magnitude: 0.38386 au
magnitude: 0.97569 debye
