program: Orca
programVersion: 5.0.2
elementType: O O C C C C C C C C C C C C C C C C C C H H H H H H H H H H H H H H H H H H H H H H H H H H H H
charge: 0
multiplicity: 1
keywords: wb97x-d3
keywords: def2-TZVPP
keywords: def2/J RIJCOSX
keywords: DEFGRID2
keywords: scfconv7
keywords: smallprint printgap noloewdin
keywords: NOSOSCF
formula: C18H28O2
InChI: InChI=1/C18H28O2/c1-6-13-20-18(19)14-17(5)12-8-11-16(4)10-7-9-15(2)3/h1,8,12,14-16H,7,9-11,13H2,2-5H3
48 atoms
O  3.903953 -2.498186 1.571856
O  3.642035 -2.272753 -0.635698
C  -3.739002 -0.124624 0.029085
C  -2.871909 1.122274 0.20496
C  -3.353091 2.341884 -0.572591
C  -2.397747 3.522493 -0.445901
C  -2.846862 4.795915 -1.164518
C  -3.070047 -1.359626 0.653068
C  -5.13127 0.057219 0.621289
C  -1.895971 5.945309 -0.850348
C  -2.956099 4.596507 -2.672203
C  -1.771359 -1.700745 0.009235
C  -0.602235 -1.775853 0.654498
C  0.68631 -2.065301 0.033212
C  0.705263 -2.316724 -1.440214
C  1.761555 -2.086316 0.852293
C  3.155256 -2.29471 0.473023
C  5.303204 -2.685024 1.384495
C  5.982529 -1.439303 1.05286
C  6.568288 -0.421604 0.800804
H  -3.845576 -0.314514 -1.046307
H  -2.805851 1.363815 1.272711
H  -1.849379 0.896658 -0.115115
H  -3.46831 2.062288 -1.624414
H  -4.34554 2.649172 -0.228197
H  -1.409319 3.233016 -0.823044
H  -2.259471 3.749211 0.617055
H  -3.839709 5.064477 -0.783955
H  -3.750086 -2.211024 0.536774
H  -2.934422 -1.206262 1.728053
H  -5.671628 0.880295 0.152849
H  -5.735644 -0.842349 0.491822
H  -5.075016 0.266233 1.692455
H  -2.219179 6.873443 -1.325502
H  -0.886822 5.727643 -1.209176
H  -1.830541 6.129992 0.223624
H  -3.698245 3.843395 -2.939256
H  -3.243294 5.523472 -3.172205
H  -1.998273 4.279776 -3.093543
H  -1.813367 -1.880172 -1.061609
H  -0.585277 -1.58697 1.724184
H  -0.018548 -3.09199 -1.694575
H  1.673828 -2.624972 -1.813392
H  0.403551 -1.417311 -1.980576
H  1.593893 -1.931319 1.911755
H  5.504514 -3.4435 0.625185
H  5.674685 -3.065632 2.335509
H  7.083883 0.485756 0.576925
elementType: O C H
totalener: -853.23474053 hartree
nucrepener: 1435.79926109 hartree
electener: -2289.03400162 hartree
oneelecener: -4006.18537269 hartree
twoeener: 1717.15137107 hartree
cpcmener: -0.02666588 hartree
kineticenergy: 849.16043903 hartree
xcener: -85.610298319927 hartree
chargesum: 0.0000000
charge: -0.284565 -0.493942 0.092149 -0.175894 -0.123523 -0.160054 0.077683 -0.117439 -0.322572 -0.299440 -0.307735 -0.129467 -0.157287 0.022738 -0.259852 -0.185301 0.484775 0.034796 -0.428860 0.035592 0.040622 0.068856 0.075789 0.065831 0.065523 0.065469 0.069022 0.025962 0.096641 0.080660 0.093626 0.092420 0.085393 0.090249 0.080288 0.088330 0.090512 0.091344 0.082768 0.127112 0.116281 0.105298 0.103598 0.112608 0.121105 0.139339 0.137573 0.285976
qa: -0.2846 -0.4939 0.0921 -0.1759 -0.1235 -0.1601 0.0777 -0.1174 -0.3226 -0.2994 -0.3077 -0.1295 -0.1573 0.0227 -0.2599 -0.1853 0.4848 0.0348 -0.4289 0.0356 0.0406 0.0689 0.0758 0.0658 0.0655 0.0655 0.0690 0.0260 0.0966 0.0807 0.0936 0.0924 0.0854 0.0902 0.0803 0.0883 0.0905 0.0913 0.0828 0.1271 0.1163 0.1053 0.1036 0.1126 0.1211 0.1393 0.1376 0.2860
va: 2.1214 2.0038 3.7692 3.8982 3.8762 3.8859 3.8116 3.9110 3.9457 3.9306 3.9277 3.8764 3.8988 3.7258 3.9310 3.7881 4.1337 3.9016 3.7136 3.6350 1.0227 1.0132 1.0101 1.0092 1.0105 1.0121 1.0115 1.0186 1.0057 1.0150 1.0020 1.0042 1.0010 1.0048 1.0032 1.0046 1.0020 1.0043 1.0025 1.0043 1.0224 0.9958 1.0288 0.9952 1.0299 0.9997 0.9897 0.9457
dispcorr: -0.018412908 hartree
energy: -853.253153434995
dipole: -38.80477 37.37545 -1.42932 27.26640 -27.34920 -0.08280 -8.57935 9.11426 0.53491
magnitude: 1.52838 au
magnitude: 3.88483 debye
