program: Orca
programVersion: 5.0.2
elementType: O O C C C C C C C C C C C C C C C C C C H H H H H H H H H H H H H H H H H H H H H H H H H H H H
charge: 0
multiplicity: 1
keywords: wb97x-d3
keywords: def2-TZVPP
keywords: def2/J RIJCOSX
keywords: DEFGRID2
keywords: scfconv7
keywords: smallprint printgap noloewdin
keywords: NOSOSCF
formula: C18H28O2
InChI: InChI=1/C18H28O2/c1-6-13-20-18(19)14-17(5)12-8-11-16(4)10-7-9-15(2)3/h1,8,12,14-16H,7,9-11,13H2,2-5H3
48 atoms
O  4.458232 -2.495553 1.579471
O  3.881613 -3.390322 -0.385474
C  -2.487239 0.653768 -0.325052
C  -3.556066 1.583286 0.252336
C  -3.63325 2.948383 -0.421736
C  -4.66725 3.856979 0.234994
C  -4.808414 5.254068 -0.378399
C  -2.317428 -0.573462 0.588012
C  -2.802335 0.242079 -1.758439
C  -3.530703 6.076551 -0.24867
C  -5.27465 5.204751 -1.829565
C  -1.218321 -1.476728 0.141145
C  -0.006598 -1.499101 0.70775
C  1.124681 -2.298039 0.247584
C  0.89869 -3.221677 -0.905481
C  2.292649 -2.127499 0.906318
C  3.576164 -2.747946 0.595404
C  5.781615 -2.994655 1.411061
C  6.52023 -2.255678 0.395116
C  7.140562 -1.636194 -0.425147
H  -1.532421 1.193178 -0.321948
H  -4.53237 1.087576 0.194681
H  -3.354266 1.731423 1.318832
H  -2.644145 3.415842 -0.383081
H  -3.872718 2.827565 -1.481362
H  -4.421683 3.964212 1.297306
H  -5.643822 3.361577 0.201125
H  -5.586633 5.767168 0.197439
H  -3.261783 -1.127866 0.609311
H  -2.121246 -0.230559 1.60711
H  -2.913271 1.106836 -2.412906
H  -2.015382 -0.379337 -2.18822
H  -3.734355 -0.327392 -1.803388
H  -3.183334 6.117637 0.785846
H  -3.690686 7.10391 -0.581269
H  -2.719568 5.665385 -0.852944
H  -6.18284 4.608423 -1.938952
H  -5.492414 6.206275 -2.205187
H  -4.515837 4.773168 -2.485388
H  -1.425417 -2.11208 -0.713692
H  0.180475 -0.853109 1.561124
H  1.73589 -3.879767 -1.101295
H  0.697774 -2.650005 -1.813589
H  0.018086 -3.838019 -0.722112
H  2.302865 -1.449005 1.751297
H  5.776908 -4.061531 1.178591
H  6.26329 -2.872078 2.380695
H  7.689773 -1.081452 -1.152918
elementType: O C H
totalener: -853.23253362 hartree
nucrepener: 1407.99695498 hartree
electener: -2261.22948860 hartree
oneelecener: -3950.48933886 hartree
twoeener: 1689.25985025 hartree
cpcmener: -0.02671534 hartree
kineticenergy: 849.16195908 hartree
xcener: -85.611789948397 hartree
chargesum: 0.0000000
charge: -0.284693 -0.494103 0.126284 -0.195136 -0.135018 -0.157397 0.077871 -0.129264 -0.333918 -0.318500 -0.322821 -0.131843 -0.149540 0.016564 -0.262813 -0.186924 0.485310 0.037531 -0.427519 0.031213 0.041435 0.069518 0.072650 0.068616 0.073643 0.074380 0.074101 0.038057 0.093306 0.081771 0.095197 0.094137 0.086704 0.092109 0.094025 0.080896 0.093223 0.095401 0.080212 0.132230 0.116250 0.105480 0.113656 0.104084 0.121023 0.139264 0.137760 0.285585
qa: -0.2847 -0.4941 0.1263 -0.1951 -0.1350 -0.1574 0.0779 -0.1293 -0.3339 -0.3185 -0.3228 -0.1318 -0.1495 0.0166 -0.2628 -0.1869 0.4853 0.0375 -0.4275 0.0312 0.0414 0.0695 0.0726 0.0686 0.0736 0.0744 0.0741 0.0381 0.0933 0.0818 0.0952 0.0941 0.0867 0.0921 0.0940 0.0809 0.0932 0.0954 0.0802 0.1322 0.1162 0.1055 0.1137 0.1041 0.1210 0.1393 0.1378 0.2856
va: 2.1222 2.0043 3.7568 3.9367 3.8657 3.8882 3.8179 3.9369 3.9565 3.9412 3.9428 3.8754 3.9029 3.7228 3.9344 3.7905 4.1354 3.8998 3.7078 3.6421 1.0240 1.0104 1.0120 1.0052 1.0009 1.0100 1.0095 1.0108 1.0064 1.0162 1.0024 1.0013 1.0007 1.0029 1.0040 0.9977 1.0023 1.0046 0.9974 0.9940 1.0221 1.0277 0.9954 0.9965 1.0300 0.9993 0.9899 0.9460
dispcorr: -0.018442659 hartree
energy: -853.250976281438
dipole: -45.18907 43.93870 -1.25036 31.86579 -31.24778 0.61800 -8.51456 9.10214 0.58758
magnitude: 1.51347 au
magnitude: 3.84693 debye
