program: Orca
programVersion: 5.0.2
elementType: O O C C C C C C C C C C C C C C C C C C H H H H H H H H H H H H H H H H H H H H H H H H H H H H
charge: 0
multiplicity: 1
keywords: wb97x-d3
keywords: def2-TZVPP
keywords: def2/J RIJCOSX
keywords: DEFGRID2
keywords: scfconv7
keywords: smallprint printgap noloewdin
keywords: NOSOSCF
formula: C18H28O2
InChI: InChI=1/C18H28O2/c1-6-13-20-18(19)14-17(5)12-8-11-16(4)10-7-9-15(2)3/h1,8,12,14-16H,7,9-11,13H2,2-5H3
48 atoms
O  5.227809 -1.675237 0.878775
O  3.98023 -3.420213 0.252079
C  -2.480308 0.770035 0.414675
C  -3.428806 1.969412 0.441308
C  -4.054687 2.336348 -0.899372
C  -5.08088 3.45535 -0.761879
C  -5.711309 3.920225 -2.075074
C  -1.215153 1.073039 -0.403882
C  -2.118768 0.350274 1.834276
C  -6.530544 2.819495 -2.740326
C  -6.575867 5.153407 -1.840147
C  -0.324103 -0.112005 -0.545438
C  0.93136 -0.171671 -0.087713
C  1.809259 -1.334338 -0.177369
C  1.285697 -2.548571 -0.873908
C  3.035416 -1.209559 0.378426
C  4.072907 -2.231995 0.47098
C  6.345735 -2.540117 1.052051
C  6.213626 -3.372207 2.241085
C  6.127457 -4.042094 3.234072
H  -3.003595 -0.064948 -0.067531
H  -4.235504 1.75113 1.149468
H  -2.897656 2.83709 0.850158
H  -3.283398 2.647751 -1.610794
H  -4.523193 1.444328 -1.326526
H  -4.598685 4.313294 -0.280325
H  -5.877868 3.135762 -0.079531
H  -4.900299 4.201601 -2.757651
H  -0.672852 1.902502 0.06046
H  -1.506828 1.403006 -1.406026
H  -1.490675 -0.541424 1.852474
H  -1.575086 1.145118 2.351282
H  -3.014662 0.130131 2.417218
H  -5.924645 1.952002 -3.004941
H  -6.999066 3.177446 -3.659122
H  -7.329219 2.473987 -2.078404
H  -5.999149 5.969267 -1.400051
H  -7.009819 5.521178 -2.771876
H  -7.401942 4.929806 -1.160197
H  -0.761714 -0.972075 -1.044819
H  1.343258 0.698872 0.41499
H  2.020448 -3.337235 -0.977301
H  0.930485 -2.282173 -1.870175
H  0.427738 -2.953576 -0.334145
H  3.297357 -0.252036 0.81338
H  7.207834 -1.882114 1.15599
H  6.509489 -3.160094 0.168341
H  6.053662 -4.638467 4.11591
elementType: O C H
totalener: -853.23487421 hartree
nucrepener: 1400.86038344 hartree
electener: -2254.09525766 hartree
oneelecener: -3936.15636451 hartree
twoeener: 1682.06110685 hartree
cpcmener: -0.02683940 hartree
kineticenergy: 849.15561207 hartree
xcener: -85.609416567537 hartree
chargesum: -0.0000000
charge: -0.284234 -0.494315 0.103859 -0.181767 -0.112646 -0.163836 0.076865 -0.118304 -0.325681 -0.305681 -0.297599 -0.146342 -0.144926 0.016839 -0.259003 -0.184911 0.485347 0.034454 -0.426905 0.032005 0.043487 0.071734 0.070671 0.062704 0.065190 0.068972 0.065641 0.024903 0.079959 0.100593 0.094762 0.084422 0.093897 0.090393 0.091206 0.082056 0.088225 0.089519 0.080044 0.127847 0.115667 0.103597 0.105721 0.110654 0.120860 0.138654 0.139557 0.285849
qa: -0.2842 -0.4943 0.1039 -0.1818 -0.1126 -0.1638 0.0769 -0.1183 -0.3257 -0.3057 -0.2976 -0.1463 -0.1449 0.0168 -0.2590 -0.1849 0.4853 0.0345 -0.4269 0.0320 0.0435 0.0717 0.0707 0.0627 0.0652 0.0690 0.0656 0.0249 0.0800 0.1006 0.0948 0.0844 0.0939 0.0904 0.0912 0.0821 0.0882 0.0895 0.0800 0.1278 0.1157 0.1036 0.1057 0.1107 0.1209 0.1387 0.1396 0.2858
va: 2.1209 2.0038 3.7572 3.9020 3.8690 3.8856 3.8148 3.9139 3.9491 3.9276 3.9297 3.8830 3.9150 3.7275 3.9314 3.7827 4.1354 3.8991 3.7074 3.6393 1.0224 1.0118 1.0103 1.0127 1.0096 1.0109 1.0118 1.0188 1.0169 1.0064 1.0013 1.0029 1.0052 1.0026 1.0043 1.0028 1.0046 1.0050 1.0031 1.0036 1.0229 1.0296 0.9960 0.9956 1.0304 0.9896 0.9993 0.9458
dispcorr: -0.018260412 hartree
energy: -853.253134627087
dipole: -51.58870 50.74615 -0.84254 27.67338 -26.45983 1.21355 -10.14492 9.82441 -0.32051
magnitude: 1.51173 au
magnitude: 3.84250 debye
