program: Orca
programVersion: 5.0.2
elementType: O O C C C C C C C C C C C C C C C C C C H H H H H H H H H H H H H H H H H H H H H H H H H H H H
charge: 0
multiplicity: 1
keywords: wb97x-d3
keywords: def2-TZVPP
keywords: def2/J RIJCOSX
keywords: DEFGRID2
keywords: scfconv7
keywords: smallprint printgap noloewdin
keywords: NOSOSCF
formula: C18H28O2
InChI: InChI=1/C18H28O2/c1-6-13-20-18(19)14-17(5)12-8-11-16(4)10-7-9-15(2)3/h1,8,12,14-16H,7,9-11,13H2,2-5H3
48 atoms
O  3.192213 -0.051815 1.008666
O  3.055136 -1.334941 -0.813779
C  -4.453359 -0.26545 0.273227
C  -3.60901 0.976662 0.585495
C  -2.67435 1.416891 -0.545305
C  -1.418144 2.11418 -0.037386
C  -0.373443 2.411824 -1.112594
C  -3.695677 -1.563762 0.624134
C  -5.771501 -0.244558 1.037401
C  -0.8743 3.428916 -2.132065
C  0.927182 2.885706 -0.475187
C  -2.376691 -1.686083 -0.055415
C  -1.20248 -1.486028 0.553384
C  0.092003 -1.452821 -0.118184
C  0.130418 -1.826666 -1.565055
C  1.142664 -1.013634 0.610972
C  2.520682 -0.849329 0.158756
C  4.560374 0.209459 0.709436
C  5.406928 -0.952423 0.949047
C  6.114418 -1.898313 1.166079
H  -4.680468 -0.276012 -0.799191
H  -4.26917 1.810442 0.841487
H  -3.025918 0.778892 1.492582
H  -2.368229 0.553226 -1.141354
H  -3.225773 2.065815 -1.231491
H  -0.958766 1.474578 0.72481
H  -1.685774 3.046171 0.475438
H  -0.164654 1.472266 -1.640665
H  -4.324817 -2.416114 0.350083
H  -3.559082 -1.598129 1.709242
H  -6.367342 -1.137113 0.837641
H  -5.597599 -0.199164 2.115303
H  -6.373034 0.623826 0.764411
H  -1.761535 3.079203 -2.661509
H  -0.11275 3.644464 -2.883855
H  -1.131981 4.373267 -1.645304
H  0.77497 3.809348 0.089093
H  1.328238 2.140419 0.215152
H  1.69405 3.081611 -1.227002
H  -2.405829 -1.891861 -1.121249
H  -1.197297 -1.262254 1.61645
H  -0.284505 -2.824736 -1.712903
H  1.125307 -1.807498 -1.991634
H  -0.49613 -1.139404 -2.137682
H  0.956533 -0.708028 1.634185
H  4.85194 1.022746 1.373184
H  4.680085 0.5635 -0.316728
H  6.744489 -2.740419 1.347482
elementType: O C H
totalener: -853.22960827 hartree
nucrepener: 1563.23053321 hartree
electener: -2416.46014148 hartree
oneelecener: -4260.93765738 hartree
twoeener: 1844.47751590 hartree
cpcmener: -0.02685968 hartree
kineticenergy: 849.15994910 hartree
xcener: -85.612440401018 hartree
chargesum: 0.0000000
charge: -0.286686 -0.492591 0.081465 -0.198002 -0.145830 -0.175910 0.052619 -0.132722 -0.313562 -0.299183 -0.300415 -0.070901 -0.200266 0.014951 -0.258861 -0.215940 0.502724 0.025025 -0.435780 0.051605 0.051612 0.086925 0.068782 0.072882 0.092472 0.070474 0.091870 0.026256 0.091308 0.081253 0.089835 0.087018 0.089453 0.091564 0.091105 0.083608 0.089946 0.077983 0.093657 0.133396 0.120545 0.117869 0.108466 0.100637 0.124879 0.138127 0.139998 0.286340
qa: -0.2867 -0.4926 0.0815 -0.1980 -0.1458 -0.1759 0.0526 -0.1327 -0.3136 -0.2992 -0.3004 -0.0709 -0.2003 0.0150 -0.2589 -0.2159 0.5027 0.0250 -0.4358 0.0516 0.0516 0.0869 0.0688 0.0729 0.0925 0.0705 0.0919 0.0263 0.0913 0.0813 0.0898 0.0870 0.0895 0.0916 0.0911 0.0836 0.0899 0.0780 0.0937 0.1334 0.1205 0.1179 0.1085 0.1006 0.1249 0.1381 0.1400 0.2863
va: 2.1101 2.0044 3.7504 3.8937 3.8418 3.8606 3.8168 3.9333 3.9475 3.9322 3.9265 3.8110 3.8850 3.6625 3.9151 3.7758 4.0913 3.9088 3.7518 3.6009 1.0200 1.0053 1.0099 1.0046 1.0080 1.0071 1.0122 1.0182 1.0084 1.0114 1.0043 0.9997 1.0041 1.0014 1.0044 1.0029 1.0046 1.0109 1.0046 0.9971 1.0190 0.9986 1.0312 0.9959 1.0301 0.9899 0.9987 0.9455
dispcorr: -0.023779170 hartree
energy: -853.253387438764
dipole: -29.88382 28.38913 -1.49469 14.94471 -14.45329 0.49142 -5.15734 5.45658 0.29924
magnitude: 1.60161 au
magnitude: 4.07096 debye
