program: Orca
programVersion: 5.0.2
elementType: O O C C C C C C C C C C C C C C C C C C H H H H H H H H H H H H H H H H H H H H H H H H H H H H
charge: 0
multiplicity: 1
keywords: wb97x-d3
keywords: def2-TZVPP
keywords: def2/J RIJCOSX
keywords: DEFGRID2
keywords: scfconv7
keywords: smallprint printgap noloewdin
keywords: NOSOSCF
formula: C18H28O2
InChI: InChI=1/C18H28O2/c1-6-13-20-18(19)14-17(5)12-8-11-16(4)10-7-9-15(2)3/h1,8,12,14-16H,7,9-11,13H2,2-5H3
48 atoms
O  3.559088 -1.558231 1.222029
O  3.176975 -1.721606 -0.974339
C  -4.314418 -0.188502 -0.260071
C  -3.493803 1.062462 -0.592712
C  -2.955814 1.836037 0.605468
C  -2.281752 3.152864 0.222539
C  -1.062816 3.045391 -0.696622
C  -3.515649 -1.231731 0.538116
C  -5.611618 0.142247 0.46941
C  -0.543918 4.43685 -1.041631
C  0.045531 2.200176 -0.079958
C  -2.229867 -1.597215 -0.118675
C  -1.032993 -1.473134 0.46518
C  0.252608 -1.746123 -0.167317
C  0.245703 -2.248162 -1.574857
C  1.354165 -1.505353 0.578005
C  2.745093 -1.616167 0.152975
C  4.961482 -1.600199 0.975177
C  5.450898 -0.349378 0.408518
C  5.861679 0.687748 -0.03647
H  -4.581723 -0.651342 -1.217033
H  -2.66191 0.773158 -1.24228
H  -4.119569 1.731611 -1.193458
H  -3.774483 2.066292 1.292807
H  -2.258666 1.213702 1.173581
H  -1.977108 3.672561 1.138062
H  -3.025596 3.798849 -0.256788
H  -1.371569 2.566548 -1.632452
H  -4.135546 -2.130202 0.632351
H  -3.329183 -0.87339 1.554016
H  -5.4266 0.552433 1.463596
H  -6.201595 0.873896 -0.085153
H  -6.227738 -0.749518 0.596973
H  -0.205492 4.963481 -0.145919
H  -1.318389 5.04786 -1.509276
H  0.299323 4.388275 -1.733102
H  0.371673 2.618073 0.876044
H  -0.273524 1.173256 0.10125
H  0.918087 2.155277 -0.734514
H  -2.30444 -1.961153 -1.13966
H  -0.990886 -1.101303 1.485178
H  1.224208 -2.549184 -1.929149
H  -0.136265 -1.477944 -2.248284
H  -0.425379 -3.103242 -1.663377
H  1.213129 -1.18463 1.603763
H  5.227936 -2.441434 0.331268
H  5.422219 -1.771968 1.947851
H  6.232035 1.604452 -0.439395
elementType: O C H
totalener: -853.23300955 hartree
nucrepener: 1531.09348641 hartree
electener: -2384.32649596 hartree
oneelecener: -4196.88488639 hartree
twoeener: 1812.55839043 hartree
cpcmener: -0.02688942 hartree
kineticenergy: 849.16084024 hartree
xcener: -85.615376587957 hartree
chargesum: -0.0000000
charge: -0.284321 -0.495041 0.070404 -0.162292 -0.152219 -0.194888 0.079145 -0.134869 -0.329546 -0.304434 -0.275481 -0.104043 -0.168904 0.012029 -0.262738 -0.200372 0.496122 0.036991 -0.427270 0.031248 0.053693 0.079131 0.086655 0.088303 0.070949 0.078144 0.074401 0.035133 0.098881 0.081486 0.083623 0.094544 0.095301 0.081587 0.087831 0.090633 0.088547 0.043873 0.092978 0.131218 0.124308 0.104033 0.113293 0.106800 0.121621 0.139653 0.138021 0.285840
qa: -0.2843 -0.4950 0.0704 -0.1623 -0.1522 -0.1949 0.0791 -0.1349 -0.3295 -0.3044 -0.2755 -0.1040 -0.1689 0.0120 -0.2627 -0.2004 0.4961 0.0370 -0.4273 0.0312 0.0537 0.0791 0.0867 0.0883 0.0709 0.0781 0.0744 0.0351 0.0989 0.0815 0.0836 0.0945 0.0953 0.0816 0.0878 0.0906 0.0885 0.0439 0.0930 0.1312 0.1243 0.1040 0.1133 0.1068 0.1216 0.1397 0.1380 0.2858
va: 2.1235 2.0014 3.8080 3.8670 3.8609 3.9191 3.7932 3.9149 3.9504 3.9339 3.9273 3.8459 3.8592 3.6789 3.9316 3.7604 4.1193 3.8961 3.7122 3.6408 1.0132 1.0075 1.0074 1.0106 1.0020 1.0108 1.0092 1.0155 1.0066 1.0065 0.9985 1.0032 1.0034 1.0035 1.0048 1.0039 1.0060 1.0103 1.0075 1.0006 1.0190 1.0263 0.9948 0.9963 1.0313 0.9998 0.9902 0.9459
dispcorr: -0.022194546 hartree
energy: -853.255204096121
dipole: -31.65400 30.27357 -1.38043 17.68218 -17.83157 -0.14939 -2.70278 3.26853 0.56575
magnitude: 1.49933 au
magnitude: 3.81098 debye
