program: Orca
programVersion: 5.0.2
elementType: O O C C C C C C C C C C C C C C C C C C H H H H H H H H H H H H H H H H H H H H H H H H H H H H
charge: 0
multiplicity: 1
keywords: wb97x-d3
keywords: def2-TZVPP
keywords: def2/J RIJCOSX
keywords: DEFGRID2
keywords: scfconv7
keywords: smallprint printgap noloewdin
keywords: NOSOSCF
formula: C18H28O2
InChI: InChI=1/C18H28O2/c1-6-13-20-18(19)14-17(5)12-8-11-16(4)10-7-9-15(2)3/h1,8,12,14-16H,7,9-11,13H2,2-5H3
48 atoms
O  3.728898 -0.320309 0.776365
O  3.369616 -1.89143 -0.771302
C  -4.294268 -0.418728 -0.021264
C  -3.673363 0.86981 -0.570217
C  -3.154228 1.851417 0.474654
C  -2.694875 3.182652 -0.117498
C  -1.576847 3.10712 -1.160384
C  -3.313145 -1.230716 0.838834
C  -5.579107 -0.161725 0.757099
C  -1.252458 4.503899 -1.677156
C  -0.323787 2.436133 -0.61016
C  -2.042925 -1.548764 0.12855
C  -0.834098 -1.175897 0.563042
C  0.434484 -1.456207 -0.101434
C  0.395101 -2.218167 -1.386445
C  1.544737 -0.969857 0.49713
C  2.928785 -1.136079 0.066277
C  5.12553 -0.374329 0.503732
C  5.736881 -1.592608 1.019198
C  6.261738 -2.577384 1.462259
H  -4.552411 -1.036089 -0.889408
H  -2.859376 0.600841 -1.250731
H  -4.422814 1.374181 -1.190185
H  -3.938743 2.06275 1.206804
H  -2.335913 1.397518 1.040812
H  -2.361784 3.834581 0.698126
H  -3.55893 3.68305 -0.568525
H  -1.931796 2.514613 -2.010799
H  -3.805927 -2.168562 1.118066
H  -3.098806 -0.701794 1.771466
H  -5.394653 0.401931 1.673449
H  -6.29631 0.40424 0.159787
H  -6.058347 -1.099341 1.044509
H  -0.88006 5.144048 -0.87328
H  -2.133582 4.988981 -2.101811
H  -0.486592 4.474118 -2.454533
H  0.049196 2.965099 0.270989
H  -0.504927 1.400341 -0.320249
H  0.477115 2.427647 -1.352093
H  -2.141971 -2.10634 -0.798935
H  -0.769664 -0.61473 1.491351
H  -0.299304 -1.740148 -2.07936
H  0.020563 -3.229848 -1.216876
H  1.359452 -2.292168 -1.874077
H  1.41526 -0.388148 1.402306
H  5.552221 0.493378 1.006142
H  5.325885 -0.267163 -0.564504
H  6.717995 -3.45747 1.857239
elementType: O C H
totalener: -853.23311014 hartree
nucrepener: 1518.72699630 hartree
electener: -2371.96010644 hartree
oneelecener: -4171.96781783 hartree
twoeener: 1800.00771139 hartree
cpcmener: -0.02691032 hartree
kineticenergy: 849.16192052 hartree
xcener: -85.615697227394 hartree
chargesum: -0.0000000
charge: -0.284145 -0.493796 0.073822 -0.173207 -0.145222 -0.198549 0.083963 -0.133684 -0.328962 -0.304803 -0.271958 -0.101666 -0.179358 0.018505 -0.260957 -0.197293 0.492872 0.032936 -0.428465 0.034471 0.052516 0.080856 0.087782 0.088745 0.070327 0.076506 0.074082 0.034477 0.099772 0.082293 0.083116 0.094121 0.095403 0.081420 0.087930 0.090077 0.088537 0.039670 0.092874 0.131416 0.125764 0.104490 0.113955 0.104346 0.121411 0.137803 0.140281 0.285532
qa: -0.2841 -0.4938 0.0738 -0.1732 -0.1452 -0.1985 0.0840 -0.1337 -0.3290 -0.3048 -0.2720 -0.1017 -0.1794 0.0185 -0.2610 -0.1973 0.4929 0.0329 -0.4285 0.0345 0.0525 0.0809 0.0878 0.0887 0.0703 0.0765 0.0741 0.0345 0.0998 0.0823 0.0831 0.0941 0.0954 0.0814 0.0879 0.0901 0.0885 0.0397 0.0929 0.1314 0.1258 0.1045 0.1140 0.1043 0.1214 0.1378 0.1403 0.2855
va: 2.1208 2.0048 3.8002 3.8725 3.8555 3.9203 3.7924 3.9127 3.9491 3.9336 3.9293 3.8476 3.8742 3.6826 3.9314 3.7631 4.1349 3.9016 3.7074 3.6387 1.0138 1.0060 1.0072 1.0107 1.0029 1.0108 1.0089 1.0151 1.0058 1.0066 0.9987 1.0033 1.0035 1.0036 1.0046 1.0041 1.0048 1.0112 1.0078 1.0001 1.0185 0.9957 0.9956 1.0286 1.0313 0.9900 0.9988 0.9460
dispcorr: -0.021978545 hartree
energy: -853.255088686431
dipole: -34.57921 33.16660 -1.41261 18.14607 -17.61472 0.53135 -4.81549 5.10879 0.29330
magnitude: 1.53747 au
magnitude: 3.90795 debye
