program: Orca
programVersion: 5.0.2
elementType: O O C C C C C C C C C C C C C C C C C C H H H H H H H H H H H H H H H H H H H H H H H H H H H H
charge: 0
multiplicity: 1
keywords: wb97x-d3
keywords: def2-TZVPP
keywords: def2/J RIJCOSX
keywords: DEFGRID2
keywords: scfconv7
keywords: smallprint printgap noloewdin
keywords: NOSOSCF
formula: C18H28O2
InChI: InChI=1/C18H28O2/c1-6-13-20-18(19)14-17(5)12-8-11-16(4)10-7-9-15(2)3/h1,8,12,14-16H,7,9-11,13H2,2-5H3
48 atoms
O  3.426255 -0.312179 0.459716
O  3.244236 -2.53905 0.496862
C  -3.650202 -0.047247 -0.676863
C  -3.567422 0.629802 0.697668
C  -3.206798 2.113595 0.662513
C  -1.749079 2.367894 0.290477
C  -1.294247 3.821788 0.422066
C  -3.53186 -1.56536 -0.551698
C  -4.953111 0.313363 -1.382223
C  0.209098 3.925169 0.191158
C  -2.043818 4.74769 -0.529103
C  -2.190474 -2.119726 -0.197614
C  -1.038401 -1.439991 -0.166525
C  0.268312 -2.006911 0.151332
C  0.338233 -3.463304 0.478508
C  1.312971 -1.147667 0.13375
C  2.717628 -1.453841 0.382186
C  4.827083 -0.427133 0.687524
C  5.537973 -0.903016 -0.492244
C  6.135886 -1.268981 -1.467452
H  -2.828139 0.310284 -1.306125
H  -4.533793 0.500088 1.196966
H  -2.836283 0.11443 1.327972
H  -3.873889 2.64326 -0.023903
H  -3.394385 2.543324 1.651807
H  -1.556417 2.033053 -0.735512
H  -1.115392 1.746112 0.93326
H  -1.502288 4.147213 1.448561
H  -3.836392 -2.041124 -1.492504
H  -4.258653 -1.929219 0.184725
H  -4.987756 -0.100241 -2.391601
H  -5.814925 -0.075654 -0.834312
H  -5.07915 1.393637 -1.468925
H  0.56527 4.949192 0.318419
H  0.472187 3.608712 -0.821514
H  0.765475 3.294133 0.887045
H  -1.687372 5.775793 -0.441035
H  -1.900671 4.437801 -1.567709
H  -3.116872 4.760273 -0.334097
H  -2.187562 -3.181271 0.030176
H  -1.038188 -0.380046 -0.396571
H  0.036414 -4.058557 -0.385283
H  -0.362579 -3.699282 1.28041
H  1.323879 -3.789749 0.785032
H  1.10527 -0.106008 -0.083577
H  5.038809 -1.069053 1.545214
H  5.162936 0.578365 0.939177
H  6.662429 -1.600041 -2.334703
elementType: O C H
totalener: -853.23155091 hartree
nucrepener: 1504.99483677 hartree
electener: -2358.22638768 hartree
oneelecener: -4144.47732689 hartree
twoeener: 1786.25093921 hartree
cpcmener: -0.02680579 hartree
kineticenergy: 849.14813115 hartree
xcener: -85.612297154695 hartree
chargesum: -0.0000000
charge: -0.285181 -0.494750 0.092992 -0.199858 -0.137432 -0.160526 0.071043 -0.127867 -0.317436 -0.296609 -0.304117 -0.101969 -0.140916 -0.015886 -0.271716 -0.154622 0.473693 0.034188 -0.426640 0.031284 0.044689 0.088166 0.089826 0.067762 0.075529 0.070518 0.067153 0.026245 0.089960 0.087370 0.092418 0.084367 0.093794 0.092496 0.079580 0.087254 0.090943 0.082668 0.089676 0.126207 0.101674 0.112210 0.105296 0.104585 0.118009 0.139790 0.138027 0.286114
qa: -0.2852 -0.4948 0.0930 -0.1999 -0.1374 -0.1605 0.0710 -0.1279 -0.3174 -0.2966 -0.3041 -0.1020 -0.1409 -0.0159 -0.2717 -0.1546 0.4737 0.0342 -0.4266 0.0313 0.0447 0.0882 0.0898 0.0678 0.0755 0.0705 0.0672 0.0262 0.0900 0.0874 0.0924 0.0844 0.0938 0.0925 0.0796 0.0873 0.0909 0.0827 0.0897 0.1262 0.1017 0.1122 0.1053 0.1046 0.1180 0.1398 0.1380 0.2861
va: 2.1188 2.0045 3.7276 3.8948 3.8929 3.8754 3.8327 3.9656 3.9402 3.9245 3.9306 3.8912 3.8597 3.7324 3.9312 3.7592 4.1561 3.9003 3.7079 3.6411 1.0140 1.0113 1.0040 1.0069 1.0100 1.0090 1.0102 1.0185 1.0041 1.0050 1.0033 1.0031 1.0013 1.0057 1.0036 1.0057 1.0048 1.0022 1.0026 1.0042 1.0270 0.9947 0.9951 1.0301 1.0272 0.9991 0.9900 0.9457
dispcorr: -0.020536074 hartree
energy: -853.252086985695
dipole: -32.63027 31.16016 -1.47012 19.44927 -18.86974 0.57953 -1.63950 1.69615 0.05664
magnitude: 1.58123 au
magnitude: 4.01918 debye
