program: Orca
programVersion: 5.0.2
elementType: O O C C C C C C C C C C C C C C C C C C H H H H H H H H H H H H H H H H H H H H H H H H H H H H
charge: 0
multiplicity: 1
keywords: wb97x-d3
keywords: def2-TZVPP
keywords: def2/J RIJCOSX
keywords: DEFGRID2
keywords: scfconv7
keywords: smallprint printgap noloewdin
keywords: NOSOSCF
formula: C18H28O2
InChI: InChI=1/C18H28O2/c1-6-13-20-18(19)14-17(5)12-8-11-16(4)10-7-9-15(2)3/h1,8,12,14-16H,7,9-11,13H2,2-5H3
48 atoms
O  3.634928 -0.113262 0.882575
O  3.284925 -1.719011 -0.632603
C  -4.402005 -0.356847 0.26472
C  -3.849914 1.053108 0.011577
C  -3.141973 1.235525 -1.328394
C  -2.508432 2.6174 -1.482126
C  -1.224788 2.830649 -0.672746
C  -3.392235 -1.247178 1.008634
C  -5.697861 -0.298798 1.066216
C  -0.049159 2.075653 -1.283148
C  -0.897098 4.315208 -0.564837
C  -2.112997 -1.467257 0.28038
C  -0.913326 -1.089747 0.737867
C  0.357714 -1.308311 0.05556
C  0.329004 -1.98402 -1.277958
C  1.466755 -0.847691 0.676014
C  2.843798 -0.967383 0.209032
C  5.020995 -0.10776 0.555736
C  5.714454 -1.280462 1.072166
C  6.300617 -2.224546 1.527795
H  -4.623294 -0.826345 -0.701368
H  -4.673145 1.774025 0.051183
H  -3.181765 1.325417 0.835992
H  -2.385623 0.459099 -1.474001
H  -3.875466 1.085346 -2.126209
H  -3.248652 3.3721 -1.193271
H  -2.285174 2.807036 -2.537718
H  -1.383382 2.448549 0.34234
H  -3.860603 -2.222752 1.181145
H  -3.192234 -0.812459 1.99261
H  -6.095278 -1.296445 1.262018
H  -5.540895 0.189687 2.030973
H  -6.465378 0.264729 0.533607
H  -0.2634 1.014623 -1.419312
H  0.840826 2.14906 -0.655226
H  0.204466 2.486333 -2.264013
H  -1.699547 4.867913 -0.072819
H  0.017634 4.483447 0.006763
H  -0.751041 4.756805 -1.553961
H  -2.195234 -1.972214 -0.677779
H  -0.858943 -0.586403 1.699172
H  0.073258 -3.039529 -1.164033
H  1.271026 -1.92244 -1.810027
H  -0.442587 -1.539318 -1.907737
H  1.341398 -0.316571 1.612465
H  5.424201 0.791062 1.021057
H  5.174203 -0.016639 -0.521548
H  6.811358 -3.071862 1.927432
elementType: O C H
totalener: -853.23140467 hartree
nucrepener: 1532.87235006 hartree
electener: -2386.10375473 hartree
oneelecener: -4200.25736594 hartree
twoeener: 1814.15361121 hartree
cpcmener: -0.02749667 hartree
kineticenergy: 849.15479772 hartree
xcener: -85.611355159683 hartree
chargesum: 0.0000000
charge: -0.285485 -0.493991 0.080410 -0.191369 -0.130701 -0.166935 0.070574 -0.130816 -0.310558 -0.312477 -0.298580 -0.084804 -0.186787 -0.005094 -0.259669 -0.189091 0.496362 0.032805 -0.427889 0.034902 0.044728 0.077674 0.075956 0.065461 0.081408 0.069247 0.080958 0.033856 0.093561 0.080978 0.089440 0.088641 0.089111 0.069802 0.095854 0.094671 0.087507 0.089670 0.082670 0.132789 0.117399 0.124642 0.106682 0.101061 0.122141 0.137496 0.139916 0.285875
qa: -0.2855 -0.4940 0.0804 -0.1914 -0.1307 -0.1669 0.0706 -0.1308 -0.3106 -0.3125 -0.2986 -0.0848 -0.1868 -0.0051 -0.2597 -0.1891 0.4964 0.0328 -0.4279 0.0349 0.0447 0.0777 0.0760 0.0655 0.0814 0.0692 0.0810 0.0339 0.0936 0.0810 0.0894 0.0886 0.0891 0.0698 0.0959 0.0947 0.0875 0.0897 0.0827 0.1328 0.1174 0.1246 0.1067 0.1011 0.1221 0.1375 0.1399 0.2859
va: 2.1159 2.0027 3.7465 3.8661 3.8920 3.9177 3.7782 3.9324 3.9430 3.9438 3.9254 3.8436 3.8537 3.7264 3.9185 3.7803 4.1061 3.9020 3.7135 3.6333 1.0218 1.0086 1.0096 1.0106 1.0125 1.0081 1.0099 1.0205 1.0061 1.0123 1.0048 0.9992 1.0038 0.9997 1.0032 1.0089 1.0048 1.0039 1.0031 0.9980 1.0215 0.9946 1.0239 0.9955 1.0302 0.9901 0.9991 0.9458
dispcorr: -0.022655038 hartree
energy: -853.254059705110
dipole: -33.60229 32.17145 -1.43083 15.70489 -15.13589 0.56900 -6.05733 6.37497 0.31764
magnitude: 1.57224 au
magnitude: 3.99632 debye
