program: Orca
programVersion: 5.0.2
elementType: O O C C C C C C C C C C C C C C C C C C H H H H H H H H H H H H H H H H H H H H H H H H H H H H
charge: 0
multiplicity: 1
keywords: wb97x-d3
keywords: def2-TZVPP
keywords: def2/J RIJCOSX
keywords: DEFGRID2
keywords: scfconv7
keywords: smallprint printgap noloewdin
keywords: NOSOSCF
formula: C18H28O2
InChI: InChI=1/C18H28O2/c1-6-13-20-18(19)14-17(5)12-8-11-16(4)10-7-9-15(2)3/h1,8,12,14-16H,7,9-11,13H2,2-5H3
48 atoms
O  3.71322 -0.230882 1.157699
O  3.381633 -1.440312 -0.691776
C  -4.382542 -0.225108 0.209805
C  -4.235444 1.221447 0.691191
C  -2.902623 1.915182 0.427997
C  -2.551584 2.037424 -1.050166
C  -1.360721 2.950596 -1.346295
C  -3.344616 -1.176131 0.835366
C  -5.790364 -0.718195 0.530815
C  -0.06802 2.43501 -0.723092
C  -1.184745 3.122967 -2.850415
C  -2.038194 -1.235615 0.120835
C  -0.843815 -1.049207 0.692757
C  0.439921 -1.145023 0.008286
C  0.428647 -1.511841 -1.440831
C  1.539862 -0.850087 0.736975
C  2.927427 -0.891642 0.288161
C  5.109226 -0.198299 0.876266
C  5.746888 -1.484564 1.125758
C  6.283811 -2.535614 1.347554
H  -4.260968 -0.253033 -0.879168
H  -5.032037 1.814717 0.22877
H  -4.435814 1.240338 1.768442
H  -2.956456 2.920337 0.859521
H  -2.104294 1.402961 0.968895
H  -3.427296 2.419665 -1.587338
H  -2.348848 1.04699 -1.47429
H  -1.578985 3.934668 -0.913809
H  -3.760802 -2.190328 0.810756
H  -3.196431 -0.930596 1.891278
H  -5.952943 -0.762315 1.610593
H  -6.549437 -0.055412 0.111801
H  -5.965681 -1.717749 0.129739
H  0.186898 1.450343 -1.122193
H  -0.134904 2.346663 0.362077
H  0.767594 3.102429 -0.942662
H  -0.960117 2.165891 -3.328485
H  -2.087824 3.520199 -3.317787
H  -0.365364 3.80562 -3.08284
H  -2.099754 -1.477721 -0.936455
H  -0.804711 -0.796888 1.74866
H  0.024631 -2.516706 -1.57619
H  1.407517 -1.477372 -1.902699
H  -0.228073 -0.833918 -1.989291
H  1.39781 -0.534069 1.764119
H  5.52264 0.555669 1.545462
H  5.300007 0.130451 -0.147495
H  6.768526 -3.467896 1.534784
elementType: O C H
totalener: -853.23165854 hartree
nucrepener: 1534.78064713 hartree
electener: -2388.01230566 hartree
oneelecener: -4204.05801869 hartree
twoeener: 1816.04571303 hartree
cpcmener: -0.02723347 hartree
kineticenergy: 849.16114409 hartree
xcener: -85.614032584116 hartree
chargesum: -0.0000000
charge: -0.285457 -0.493838 0.093292 -0.224496 -0.102333 -0.192676 0.096109 -0.132115 -0.308760 -0.317548 -0.300567 -0.115366 -0.163375 -0.015838 -0.246026 -0.183891 0.492075 0.035197 -0.425763 0.031931 0.049680 0.075835 0.077638 0.081997 0.070837 0.082896 0.064334 0.027748 0.097020 0.086367 0.087165 0.088863 0.090055 0.066634 0.095131 0.103046 0.081688 0.088590 0.090669 0.128463 0.120033 0.121036 0.107325 0.092154 0.121338 0.137612 0.139476 0.285816
qa: -0.2855 -0.4938 0.0933 -0.2245 -0.1023 -0.1927 0.0961 -0.1321 -0.3088 -0.3175 -0.3006 -0.1154 -0.1634 -0.0158 -0.2460 -0.1839 0.4921 0.0352 -0.4258 0.0319 0.0497 0.0758 0.0776 0.0820 0.0708 0.0829 0.0643 0.0277 0.0970 0.0864 0.0872 0.0889 0.0901 0.0666 0.0951 0.1030 0.0817 0.0886 0.0907 0.1285 0.1200 0.1210 0.1073 0.0922 0.1213 0.1376 0.1395 0.2858
va: 2.1200 2.0021 3.7030 3.9613 3.8214 3.8817 3.8021 3.9044 3.9358 3.9422 3.9325 3.8459 3.8554 3.7185 3.9072 3.7753 4.1193 3.8988 3.7103 3.6389 1.0187 1.0071 1.0100 1.0115 1.0084 1.0115 1.0067 1.0196 1.0014 1.0130 1.0009 1.0047 1.0040 1.0004 0.9987 1.0074 1.0009 1.0052 1.0050 1.0003 1.0194 0.9970 1.0292 0.9976 1.0304 0.9901 0.9996 0.9459
dispcorr: -0.022917774 hartree
energy: -853.254576312158
dipole: -34.63784 33.21469 -1.42315 14.26524 -13.68298 0.58225 -7.87710 8.29143 0.41433
magnitude: 1.59250 au
magnitude: 4.04781 debye
