program: Orca
programVersion: 5.0.2
elementType: O O C C C C C C C C C C C C C C C C C C H H H H H H H H H H H H H H H H H H H H H H H H H H H H
charge: 0
multiplicity: 1
keywords: wb97x-d3
keywords: def2-TZVPP
keywords: def2/J RIJCOSX
keywords: DEFGRID2
keywords: scfconv7
keywords: smallprint printgap noloewdin
keywords: NOSOSCF
formula: C18H28O2
InChI: InChI=1/C18H28O2/c1-6-13-20-18(19)14-17(5)12-8-11-16(4)10-7-9-15(2)3/h1,8,12,14-16H,7,9-11,13H2,2-5H3
48 atoms
O  4.96134 -1.934743 1.112128
O  3.838181 -3.648993 0.219912
C  -2.268287 0.710589 -1.243813
C  -2.836554 2.122765 -1.412475
C  -3.971047 2.503493 -0.467916
C  -4.477555 3.917309 -0.73109
C  -5.683193 4.33728 0.110516
C  -1.6400 0.523111 0.14894
C  -3.305085 -0.365998 -1.54715
C  -5.362819 4.365417 1.600799
C  -6.199743 5.696852 -0.345328
C  -0.78075 -0.692258 0.230935
C  0.542325 -0.648775 0.424809
C  1.435783 -1.802623 0.442896
C  0.82869 -3.157119 0.264884
C  2.749444 -1.544468 0.629534
C  3.847018 -2.505901 0.620756
C  6.147349 -2.724188 1.125504
C  6.709917 -2.887118 -0.208756
C  7.188782 -2.996239 -1.304482
H  -1.460897 0.612378 -1.978032
H  -2.020094 2.843249 -1.292824
H  -3.183684 2.23096 -2.445807
H  -4.803847 1.801235 -0.577439
H  -3.632938 2.417013 0.56835
H  -4.744194 4.001381 -1.79055
H  -3.662685 4.633237 -0.568077
H  -6.479692 3.601253 -0.053087
H  -2.439138 0.449946 0.89459
H  -1.046704 1.406053 0.402675
H  -2.860409 -1.361763 -1.577807
H  -4.097424 -0.38742 -0.796507
H  -3.774336 -0.193613 -2.517686
H  -4.539493 5.053851 1.808753
H  -5.077353 3.384624 1.98289
H  -6.224395 4.69942 2.182112
H  -5.441274 6.47148 -0.206529
H  -6.470316 5.688408 -1.403029
H  -7.084514 5.998873 0.218241
H  -1.27612 -1.649183 0.09805
H  1.015225 0.320405 0.556973
H  0.014372 -3.295897 0.977014
H  1.534722 -3.967427 0.399163
H  0.391909 -3.24875 -0.731289
H  3.043804 -0.515391 0.800018
H  5.972601 -3.69732 1.589001
H  6.850019 -2.181396 1.757059
H  7.607082 -3.098286 -2.281052
elementType: O C H
totalener: -853.23305293 hartree
nucrepener: 1403.65399673 hartree
electener: -2256.88704966 hartree
oneelecener: -3941.71148877 hartree
twoeener: 1684.82443911 hartree
cpcmener: -0.02692343 hartree
kineticenergy: 849.15471535 hartree
xcener: -85.609560109727 hartree
chargesum: 0.0000000
charge: -0.283885 -0.493215 0.112131 -0.174444 -0.132667 -0.168579 0.083163 -0.137918 -0.335032 -0.307548 -0.299804 -0.142630 -0.146141 0.015013 -0.262440 -0.185435 0.481624 0.035029 -0.425919 0.031733 0.053099 0.076819 0.077348 0.069030 0.075296 0.068227 0.066485 0.025463 0.092841 0.084381 0.092647 0.085558 0.096004 0.082856 0.088727 0.091585 0.080695 0.087609 0.089969 0.131040 0.114813 0.104479 0.103356 0.113066 0.121928 0.139410 0.138240 0.285991
qa: -0.2839 -0.4932 0.1121 -0.1744 -0.1327 -0.1686 0.0832 -0.1379 -0.3350 -0.3075 -0.2998 -0.1426 -0.1461 0.0150 -0.2624 -0.1854 0.4816 0.0350 -0.4259 0.0317 0.0531 0.0768 0.0773 0.0690 0.0753 0.0682 0.0665 0.0255 0.0928 0.0844 0.0926 0.0856 0.0960 0.0829 0.0887 0.0916 0.0807 0.0876 0.0900 0.1310 0.1148 0.1045 0.1034 0.1131 0.1219 0.1394 0.1382 0.2860
va: 2.1223 2.0041 3.7611 3.9006 3.8692 3.8851 3.8051 3.9418 3.9646 3.9286 3.9303 3.8946 3.9291 3.7402 3.9375 3.7908 4.1342 3.8973 3.7132 3.6396 1.0171 1.0083 1.0102 1.0055 1.0036 1.0121 1.0117 1.0189 1.0005 1.0156 1.0035 0.9965 1.0024 1.0024 1.0027 1.0044 1.0030 1.0048 1.0049 0.9969 1.0231 0.9956 1.0277 0.9954 1.0298 0.9995 0.9898 0.9458
dispcorr: -0.018370999 hartree
energy: -853.251423927764
dipole: -50.56842 49.52635 -1.04207 29.83942 -28.84935 0.99007 -3.46561 3.76237 0.29676
magnitude: 1.46772 au
magnitude: 3.73065 debye
