program: Orca
programVersion: 5.0.2
elementType: O O C C C C C C C C C C C C C C C C C C H H H H H H H H H H H H H H H H H H H H H H H H H H H H
charge: 0
multiplicity: 1
keywords: wb97x-d3
keywords: def2-TZVPP
keywords: def2/J RIJCOSX
keywords: DEFGRID2
keywords: scfconv7
keywords: smallprint printgap noloewdin
keywords: NOSOSCF
formula: C18H28O2
InChI: InChI=1/C18H28O2/c1-6-13-20-18(19)14-17(5)12-8-11-16(4)10-7-9-15(2)3/h1,8,12,14-16H,7,9-11,13H2,2-5H3
48 atoms
O  4.805902 -2.454311 -0.47883
O  3.837752 -3.45365 1.270092
C  -2.674465 0.266915 -0.877701
C  -3.344892 1.467276 -1.55307
C  -4.027142 2.462194 -0.620495
C  -4.629652 3.634575 -1.385925
C  -5.406353 4.636306 -0.530879
C  -1.522749 0.721006 0.036978
C  -3.678381 -0.611906 -0.140147
C  -4.523266 5.30744 0.515302
C  -6.066832 5.685991 -1.417124
C  -0.677186 -0.405355 0.524406
C  0.591296 -0.593207 0.142364
C  1.464786 -1.672544 0.592441
C  0.906298 -2.659979 1.565465
C  2.71515 -1.688448 0.077916
C  3.788833 -2.627725 0.385027
C  5.957697 -3.274136 -0.310455
C  6.766842 -2.854281 0.826307
C  7.460054 -2.500696 1.741765
H  -2.230748 -0.334394 -1.679105
H  -2.591652 1.998008 -2.145721
H  -4.0813 1.091564 -2.27163
H  -4.816777 1.963479 -0.048892
H  -3.306678 2.832857 0.113533
H  -5.299459 3.241879 -2.159296
H  -3.833005 4.166584 -1.920494
H  -6.198351 4.087956 -0.006593
H  -1.939799 1.247187 0.902183
H  -0.898661 1.43934 -0.502034
H  -4.086427 -0.111071 0.74011
H  -4.516684 -0.874422 -0.788432
H  -3.228178 -1.546718 0.197249
H  -3.69204 5.836983 0.042007
H  -4.099227 4.592935 1.221846
H  -5.088219 6.038838 1.096449
H  -5.317365 6.26497 -1.962848
H  -6.729635 5.22856 -2.154278
H  -6.661934 6.389235 -0.831415
H  -1.141761 -1.097667 1.219614
H  1.031454 0.116468 -0.552795
H  1.57407 -3.487133 1.771812
H  -0.032105 -3.06785 1.187361
H  0.674651 -2.16673 2.511489
H  2.970975 -0.926302 -0.648884
H  6.529945 -3.162466 -1.231154
H  5.687347 -4.328133 -0.217955
H  8.07275 -2.189725 2.558535
elementType: O C H
totalener: -853.23313471 hartree
nucrepener: 1402.55388930 hartree
electener: -2255.78702401 hartree
oneelecener: -3939.49202774 hartree
twoeener: 1683.70500372 hartree
cpcmener: -0.02679766 hartree
kineticenergy: 849.14843661 hartree
xcener: -85.608871290469 hartree
chargesum: -0.0000000
charge: -0.283280 -0.494317 0.117438 -0.177467 -0.129731 -0.170537 0.084424 -0.145639 -0.338959 -0.308260 -0.301115 -0.144894 -0.142021 0.012978 -0.263372 -0.185718 0.483675 0.033387 -0.424874 0.031625 0.053531 0.077076 0.077896 0.069440 0.074482 0.068438 0.065809 0.025765 0.095380 0.086247 0.086796 0.096114 0.092865 0.082606 0.089543 0.091364 0.080378 0.088797 0.089813 0.133839 0.115016 0.104731 0.104286 0.112901 0.120265 0.137901 0.139444 0.285934
qa: -0.2833 -0.4943 0.1174 -0.1775 -0.1297 -0.1705 0.0844 -0.1456 -0.3390 -0.3083 -0.3011 -0.1449 -0.1420 0.0130 -0.2634 -0.1857 0.4837 0.0334 -0.4249 0.0316 0.0535 0.0771 0.0779 0.0694 0.0745 0.0684 0.0658 0.0258 0.0954 0.0862 0.0868 0.0961 0.0929 0.0826 0.0895 0.0914 0.0804 0.0888 0.0898 0.1338 0.1150 0.1047 0.1043 0.1129 0.1203 0.1379 0.1394 0.2859
va: 2.1217 2.0046 3.7606 3.9022 3.8671 3.8875 3.8046 3.9385 3.9655 3.9288 3.9312 3.8911 3.9203 3.7321 3.9340 3.7812 4.1385 3.9013 3.7128 3.6396 1.0181 1.0083 1.0101 1.0053 1.0036 1.0122 1.0114 1.0186 1.0008 1.0153 0.9952 1.0024 1.0028 1.0024 1.0023 1.0048 1.0032 1.0044 1.0049 0.9949 1.0231 1.0296 0.9962 0.9949 1.0308 0.9899 0.9999 0.9457
dispcorr: -0.018377800 hartree
energy: -853.251512508571
dipole: -49.99445 48.87533 -1.11912 30.85726 -30.08599 0.77126 -5.38632 4.69511 -0.69121
magnitude: 1.52481 au
magnitude: 3.87575 debye
