program: Orca
programVersion: 5.0.2
elementType: O O C C C C C C C C C C C C C C C C C C H H H H H H H H H H H H H H H H H H H H H H H H H H H H
charge: 0
multiplicity: 1
keywords: wb97x-d3
keywords: def2-TZVPP
keywords: def2/J RIJCOSX
keywords: DEFGRID2
keywords: scfconv7
keywords: smallprint printgap noloewdin
keywords: NOSOSCF
formula: C18H28O2
InChI: InChI=1/C18H28O2/c1-6-13-20-18(19)14-17(5)12-8-11-16(4)10-7-9-15(2)3/h1,8,12,14-16H,7,9-11,13H2,2-5H3
48 atoms
O  3.352444 -0.164871 1.070368
O  3.149935 -1.414812 -0.769822
C  -4.433285 -0.334159 0.287325
C  -3.682757 0.979323 0.544685
C  -2.82309 1.461808 -0.62224
C  -1.796285 2.499653 -0.191698
C  -0.941102 3.07352 -1.321516
C  -3.59496 -1.556299 0.713157
C  -5.765376 -0.363127 1.026343
C  -0.061454 4.202674 -0.797965
C  -0.085054 2.003704 -1.990826
C  -2.281002 -1.648394 0.019999
C  -1.102751 -1.412365 0.608141
C  0.188192 -1.407123 -0.071607
C  0.213852 -1.790546 -1.515921
C  1.255389 -1.008244 0.656556
C  2.640826 -0.912316 0.207643
C  4.734546 0.022286 0.783706
C  5.51446 -1.18665 1.013335
C  6.18187 -2.162395 1.225842
H  -4.638695 -0.417237 -0.78645
H  -4.398721 1.76789 0.795663
H  -3.057102 0.858497 1.437015
H  -2.314829 0.613907 -1.085095
H  -3.472429 1.881089 -1.398231
H  -1.133226 2.051508 0.5595
H  -2.313048 3.3224 0.315159
H  -1.615658 3.492573 -2.077943
H  -4.172907 -2.461672 0.502083
H  -3.444612 -1.51458 1.796082
H  -5.618506 -0.254115 2.103572
H  -6.414682 0.450148 0.69877
H  -6.298689 -1.300865 0.8593
H  0.632451 3.836796 -0.036774
H  -0.657174 4.997552 -0.344791
H  0.533853 4.650792 -1.595712
H  0.534002 2.432975 -2.781065
H  0.586552 1.531952 -1.267317
H  -0.686994 1.215991 -2.44539
H  -2.320108 -1.883567 -1.039481
H  -1.08755 -1.166922 1.666288
H  -0.496043 -1.180348 -2.075893
H  -0.101426 -2.828286 -1.63743
H  1.187234 -1.677856 -1.976262
H  1.08267 -0.700839 1.681493
H  5.066763 0.807574 1.461767
H  4.881745 0.384032 -0.235856
H  6.771845 -3.033218 1.406031
elementType: O C H
totalener: -853.23147519 hartree
nucrepener: 1540.96810270 hartree
electener: -2394.19957789 hartree
oneelecener: -4216.47476478 hartree
twoeener: 1822.27518689 hartree
cpcmener: -0.02719915 hartree
kineticenergy: 849.16691158 hartree
xcener: -85.613218849596 hartree
chargesum: -0.0000000
charge: -0.286568 -0.493272 0.080536 -0.192294 -0.125276 -0.184337 0.104865 -0.132240 -0.312239 -0.300376 -0.323620 -0.072096 -0.197385 0.008339 -0.270638 -0.186297 0.494971 0.033520 -0.428757 0.034348 0.048756 0.083961 0.069258 0.065571 0.080318 0.061587 0.078798 0.026093 0.090980 0.081358 0.087847 0.089545 0.089254 0.080774 0.088616 0.090287 0.100701 0.070167 0.096376 0.133734 0.118045 0.097483 0.124316 0.109780 0.120904 0.138101 0.140416 0.285787
qa: -0.2866 -0.4933 0.0805 -0.1923 -0.1253 -0.1843 0.1049 -0.1322 -0.3122 -0.3004 -0.3236 -0.0721 -0.1974 0.0083 -0.2706 -0.1863 0.4950 0.0335 -0.4288 0.0343 0.0488 0.0840 0.0693 0.0656 0.0803 0.0616 0.0788 0.0261 0.0910 0.0814 0.0878 0.0895 0.0893 0.0808 0.0886 0.0903 0.1007 0.0702 0.0964 0.1337 0.1180 0.0975 0.1243 0.1098 0.1209 0.1381 0.1404 0.2858
va: 2.1159 2.0022 3.7458 3.8911 3.8402 3.8866 3.7873 3.9389 3.9465 3.9326 3.9443 3.8267 3.8877 3.6916 3.9202 3.7850 4.1069 3.9002 3.7098 3.6387 1.0209 1.0067 1.0095 1.0072 1.0137 1.0114 1.0114 1.0188 1.0080 1.0118 0.9995 1.0037 1.0045 1.0019 1.0049 1.0051 1.0079 1.0037 0.9957 0.9966 1.0210 0.9955 0.9977 1.0272 1.0309 0.9899 0.9988 0.9459
dispcorr: -0.022613565 hartree
energy: -853.254088758441
dipole: -30.89602 29.39378 -1.50224 15.22605 -14.69707 0.52898 -5.74338 6.05547 0.31209
magnitude: 1.62295 au
magnitude: 4.12521 debye
