program: Orca
programVersion: 5.0.2
elementType: O O C C C C C C C C C C C C C C C C C C H H H H H H H H H H H H H H H H H H H H H H H H H H H H
charge: 0
multiplicity: 1
keywords: wb97x-d3
keywords: def2-TZVPP
keywords: def2/J RIJCOSX
keywords: DEFGRID2
keywords: scfconv7
keywords: smallprint printgap noloewdin
keywords: NOSOSCF
formula: C18H28O2
InChI: InChI=1/C18H28O2/c1-6-13-20-18(19)14-17(5)12-8-11-16(4)10-7-9-15(2)3/h1,8,12,14-16H,7,9-11,13H2,2-5H3
48 atoms
O  3.627673 -0.06752 0.671759
O  3.28678 -1.836397 -0.650066
C  -4.338801 -0.476115 0.017661
C  -3.699925 0.713759 -0.707194
C  -3.2097 1.84487 0.193646
C  -2.616967 3.044472 -0.557424
C  -1.095982 3.037618 -0.736928
C  -3.381996 -1.149542 1.015625
C  -5.639763 -0.101589 0.718401
C  -0.589064 1.875903 -1.582763
C  -0.633147 4.361586 -1.335647
C  -2.104326 -1.581776 0.385053
C  -0.903038 -1.104016 0.728303
C  0.364482 -1.470203 0.105465
C  0.331432 -2.496153 -0.980203
C  1.463628 -0.82175 0.552369
C  2.840508 -0.99912 0.10344
C  5.016415 -0.106908 0.359832
C  5.692799 -1.228618 0.998552
C  6.270583 -2.12943 1.544385
H  -4.579891 -1.219201 -0.751024
H  -2.877757 0.348331 -1.327856
H  -4.437379 1.121042 -1.407057
H  -4.048886 2.19413 0.800705
H  -2.468104 1.471064 0.907246
H  -2.875274 3.958343 -0.01441
H  -3.09475 3.141166 -1.539916
H  -0.649044 2.945158 0.260696
H  -3.889248 -2.028233 1.428502
H  -3.180542 -0.481352 1.856963
H  -5.474351 0.59561 1.541773
H  -6.341127 0.365923 0.024836
H  -6.128856 -0.983994 1.134852
H  -1.023399 1.900477 -2.585457
H  -0.825797 0.908221 -1.140703
H  0.496539 1.920287 -1.693674
H  -1.048333 4.506447 -2.336354
H  -0.945631 5.210588 -0.724394
H  0.454249 4.401792 -1.423541
H  -2.192467 -2.312198 -0.414391
H  -0.84772 -0.365607 1.523549
H  -0.042969 -3.444208 -0.589879
H  1.297458 -2.67518 -1.435069
H  -0.360899 -2.185477 -1.764195
H  1.328931 -0.076868 1.327918
H  5.423968 0.830485 0.736693
H  5.180206 -0.126583 -0.719609
H  6.77706 -2.94009 2.01882
elementType: O C H
totalener: -853.23018346 hartree
nucrepener: 1528.38397035 hartree
electener: -2381.61415380 hartree
oneelecener: -4191.28919428 hartree
twoeener: 1809.67504048 hartree
cpcmener: -0.02672053 hartree
kineticenergy: 849.15921125 hartree
xcener: -85.614531124588 hartree
chargesum: 0.0000000
charge: -0.284483 -0.494684 0.084111 -0.188454 -0.146767 -0.183615 0.097000 -0.136380 -0.332731 -0.305165 -0.304719 -0.088101 -0.191612 0.011077 -0.258727 -0.195442 0.503285 0.032806 -0.424679 0.029480 0.053588 0.092707 0.082106 0.093894 0.065215 0.082608 0.063555 0.023921 0.098248 0.083486 0.084033 0.094150 0.095327 0.096674 0.054842 0.095336 0.081786 0.087787 0.089863 0.130615 0.121439 0.112963 0.106172 0.104798 0.118677 0.137892 0.140749 0.285369
qa: -0.2845 -0.4947 0.0841 -0.1885 -0.1468 -0.1836 0.0970 -0.1364 -0.3327 -0.3052 -0.3047 -0.0881 -0.1916 0.0111 -0.2587 -0.1954 0.5033 0.0328 -0.4247 0.0295 0.0536 0.0927 0.0821 0.0939 0.0652 0.0826 0.0636 0.0239 0.0982 0.0835 0.0840 0.0941 0.0953 0.0967 0.0548 0.0953 0.0818 0.0878 0.0899 0.1306 0.1214 0.1130 0.1062 0.1048 0.1187 0.1379 0.1407 0.2854
va: 2.1200 2.0050 3.7849 3.8897 3.8526 3.9100 3.7853 3.9157 3.9489 3.9242 3.9363 3.8307 3.8919 3.6728 3.9238 3.7514 4.1294 3.9015 3.7080 3.6471 1.0139 1.0009 1.0111 1.0047 1.0090 1.0047 1.0118 1.0205 1.0065 1.0053 0.9974 1.0034 1.0035 1.0061 1.0111 1.0069 1.0024 1.0053 1.0046 1.0002 1.0199 0.9961 1.0319 0.9950 1.0332 0.9901 0.9986 0.9461
dispcorr: -0.022394463 hartree
energy: -853.252577922583
dipole: -33.93701 32.53386 -1.40316 15.78567 -15.24018 0.54549 -6.28320 6.63945 0.35625
magnitude: 1.54704 au
magnitude: 3.93225 debye
