program: Orca
programVersion: 5.0.2
elementType: O O C C C C C C C C C C C C C C C C C C H H H H H H H H H H H H H H H H H H H H H H H H H H H H
charge: 0
multiplicity: 1
keywords: wb97x-d3
keywords: def2-TZVPP
keywords: def2/J RIJCOSX
keywords: DEFGRID2
keywords: scfconv7
keywords: smallprint printgap noloewdin
keywords: NOSOSCF
formula: C18H28O2
InChI: InChI=1/C18H28O2/c1-6-13-20-18(19)14-17(5)12-8-11-16(4)10-7-9-15(2)3/h1,8,12,14-16H,7,9-11,13H2,2-5H3
48 atoms
O  3.910876 -3.065766 -0.483631
O  3.665568 -1.888367 1.39821
C  -3.160598 -0.122889 -0.925878
C  -3.07226 1.072035 0.023415
C  -3.067687 2.429987 -0.669607
C  -2.79164 3.570639 0.302858
C  -2.628391 4.946069 -0.344359
C  -3.009958 -1.457958 -0.172462
C  -4.454924 -0.129592 -1.730068
C  -3.898312 5.404967 -1.052224
C  -2.199456 5.972691 0.697616
C  -1.731211 -1.538644 0.595619
C  -0.59119 -2.005714 0.074683
C  0.705387 -1.991167 0.743447
C  0.748812 -1.516543 2.160425
C  1.76675 -2.40586 0.015582
C  3.167412 -2.405539 0.422933
C  5.313536 -3.134169 -0.246485
C  5.971937 -1.849836 -0.448784
C  6.530455 -0.80116 -0.622549
H  -2.320212 -0.057184 -1.627761
H  -3.900652 1.025539 0.740505
H  -2.154701 0.991194 0.615498
H  -2.299055 2.430704 -1.451177
H  -4.020825 2.594854 -1.177859
H  -1.878118 3.338778 0.861463
H  -3.595728 3.619031 1.047264
H  -1.830171 4.871605 -1.092824
H  -3.056565 -2.272671 -0.899554
H  -3.859078 -1.581772 0.506025
H  -5.326493 -0.148913 -1.071402
H  -4.542276 0.749889 -2.368443
H  -4.510794 -1.005945 -2.378447
H  -3.771967 6.401131 -1.480451
H  -4.738244 5.451575 -0.354053
H  -4.183629 4.73784 -1.866475
H  -1.269431 5.679829 1.188642
H  -2.040026 6.955493 0.250158
H  -2.960164 6.084679 1.474505
H  -1.740326 -1.144876 1.606484
H  -0.60103 -2.391667 -0.941209
H  0.001468 -2.046931 2.752601
H  0.495879 -0.455328 2.21438
H  1.713428 -1.656393 2.63244
H  1.581271 -2.76647 -0.989462
H  5.692951 -3.861311 -0.963877
H  5.527722 -3.516622 0.753865
H  7.026994 0.131092 -0.773859
elementType: O C H
totalener: -853.23283355 hartree
nucrepener: 1435.34550768 hartree
electener: -2288.57834123 hartree
oneelecener: -4005.22832353 hartree
twoeener: 1716.64998230 hartree
cpcmener: -0.02667855 hartree
kineticenergy: 849.16203286 hartree
xcener: -85.610340540654 hartree
chargesum: 0.0000000
charge: -0.285119 -0.493110 0.088176 -0.172950 -0.124704 -0.159644 0.076867 -0.138416 -0.326275 -0.306487 -0.300535 -0.123510 -0.150802 0.014049 -0.259104 -0.186913 0.485604 0.034524 -0.425322 0.030810 0.043858 0.071503 0.075693 0.062190 0.073073 0.068811 0.066731 0.026408 0.089889 0.094294 0.086942 0.092902 0.092925 0.091481 0.082366 0.089451 0.088708 0.090034 0.080247 0.132615 0.117262 0.105332 0.111366 0.104416 0.121130 0.137354 0.139960 0.285921
qa: -0.2851 -0.4931 0.0882 -0.1730 -0.1247 -0.1596 0.0769 -0.1384 -0.3263 -0.3065 -0.3005 -0.1235 -0.1508 0.0140 -0.2591 -0.1869 0.4856 0.0345 -0.4253 0.0308 0.0439 0.0715 0.0757 0.0622 0.0731 0.0688 0.0667 0.0264 0.0899 0.0943 0.0869 0.0929 0.0929 0.0915 0.0824 0.0895 0.0887 0.0900 0.0802 0.1326 0.1173 0.1053 0.1114 0.1044 0.1211 0.1374 0.1400 0.2859
va: 2.1212 2.0047 3.7967 3.8999 3.8788 3.8865 3.8121 3.9168 3.9523 3.9304 3.9325 3.8674 3.8808 3.7221 3.9315 3.7902 4.1334 3.9024 3.7050 3.6423 1.0214 1.0100 1.0103 1.0096 1.0040 1.0123 1.0107 1.0184 1.0121 1.0083 1.0006 1.0010 1.0046 1.0045 1.0023 1.0022 1.0046 1.0048 1.0031 0.9919 1.0218 0.9964 0.9960 1.0278 1.0301 0.9900 0.9987 0.9459
dispcorr: -0.018504286 hartree
energy: -853.251337835460
dipole: -39.95246 38.67065 -1.28181 29.93926 -30.17324 -0.23398 -2.38743 1.82584 -0.56159
magnitude: 1.41886 au
magnitude: 3.60646 debye
