program: Orca
programVersion: 5.0.2
elementType: O O C C C C C C C C C C C C C C C C C C H H H H H H H H H H H H H H H H H H H H H H H H H H H H
charge: 0
multiplicity: 1
keywords: wb97x-d3
keywords: def2-TZVPP
keywords: def2/J RIJCOSX
keywords: DEFGRID2
keywords: scfconv7
keywords: smallprint printgap noloewdin
keywords: NOSOSCF
formula: C18H28O2
InChI: InChI=1/C18H28O2/c1-6-13-20-18(19)14-17(5)12-8-11-16(4)10-7-9-15(2)3/h1,8,12,14-16H,7,9-11,13H2,2-5H3
48 atoms
O  3.816929 -0.596198 0.120265
O  3.22639 -2.467368 1.190269
C  -3.991768 -0.15565 -0.498839
C  -3.205997 1.09187 -0.090094
C  -2.643987 1.905646 -1.250885
C  -1.660893 2.991518 -0.820219
C  -2.174784 3.996209 0.212193
C  -3.120196 -1.196345 -1.231224
C  -4.689234 -0.766709 0.711329
C  -1.072002 4.985235 0.571319
C  -3.417347 4.733848 -0.271126
C  -1.984089 -1.702371 -0.407732
C  -0.709974 -1.348285 -0.61119
C  0.434104 -1.794206 0.17827
C  0.185404 -2.790221 1.264603
C  1.629979 -1.246752 -0.133656
C  2.923498 -1.53573 0.478185
C  5.148731 -0.74042 0.60407
C  5.867421 -1.80298 -0.08713
C  6.474705 -2.65654 -0.674491
H  -4.765143 0.149786 -1.21279
H  -3.869248 1.728157 0.504367
H  -2.393015 0.800981 0.585104
H  -2.122457 1.250073 -1.953296
H  -3.471966 2.343399 -1.817288
H  -1.329986 3.542477 -1.70797
H  -0.765246 2.506522 -0.416305
H  -2.439125 3.450948 1.125062
H  -2.738934 -0.770775 -2.161293
H  -3.761194 -2.037527 -1.512038
H  -5.398967 -0.062106 1.14792
H  -5.242767 -1.66885 0.443863
H  -3.977532 -1.035167 1.494938
H  -0.774032 5.575348 -0.299051
H  -0.181385 4.473581 0.941607
H  -1.396517 5.682828 1.345786
H  -3.216623 5.274293 -1.19997
H  -4.252912 4.057221 -0.457788
H  -3.753258 5.464264 0.467493
H  -2.235217 -2.374937 0.406488
H  -0.486093 -0.667259 -1.42792
H  -0.175413 -3.728697 0.839726
H  -0.597249 -2.428704 1.932796
H  1.062951 -3.005275 1.861343
H  1.652696 -0.497123 -0.9162
H  5.164336 -0.906779 1.682982
H  5.632136 0.217196 0.4127
H  7.009597 -3.419235 -1.194843
elementType: O C H
totalener: -853.23202537 hartree
nucrepener: 1485.77677817 hartree
electener: -2339.00880354 hartree
oneelecener: -4105.97575316 hartree
twoeener: 1766.96694962 hartree
cpcmener: -0.02669165 hartree
kineticenergy: 849.15766122 hartree
xcener: -85.612940892833 hartree
chargesum: -0.0000000
charge: -0.283935 -0.492597 0.117013 -0.211482 -0.144947 -0.191890 0.079574 -0.144516 -0.323466 -0.298281 -0.310233 -0.118849 -0.168865 0.023782 -0.262604 -0.183130 0.479798 0.036678 -0.427477 0.032885 0.043416 0.080911 0.078076 0.083385 0.078876 0.077726 0.072353 0.033189 0.095349 0.101205 0.092841 0.095933 0.083158 0.081067 0.088513 0.089619 0.085206 0.087166 0.092743 0.129392 0.116449 0.113691 0.104631 0.103748 0.121243 0.138958 0.138280 0.285420
qa: -0.2839 -0.4926 0.1170 -0.2115 -0.1449 -0.1919 0.0796 -0.1445 -0.3235 -0.2983 -0.3102 -0.1188 -0.1689 0.0238 -0.2626 -0.1831 0.4798 0.0367 -0.4275 0.0329 0.0434 0.0809 0.0781 0.0834 0.0789 0.0777 0.0724 0.0332 0.0953 0.1012 0.0928 0.0959 0.0832 0.0811 0.0885 0.0896 0.0852 0.0872 0.0927 0.1294 0.1164 0.1137 0.1046 0.1037 0.1212 0.1390 0.1383 0.2854
va: 2.1221 2.0055 3.7693 3.9105 3.8626 3.9075 3.7795 3.9143 3.9493 3.9268 3.9357 3.8330 3.9037 3.7200 3.9317 3.7876 4.1379 3.8987 3.7129 3.6396 1.0169 1.0070 1.0039 1.0146 1.0060 1.0106 1.0084 1.0155 1.0075 1.0061 1.0051 1.0036 0.9970 1.0040 1.0044 1.0044 1.0024 1.0014 1.0049 0.9941 1.0203 0.9956 0.9954 1.0284 1.0303 1.0000 0.9898 0.9461
dispcorr: -0.020309913 hartree
energy: -853.252335283501
dipole: -36.45236 35.14468 -1.30769 22.51158 -21.78878 0.72280 -0.53880 0.14689 -0.39191
magnitude: 1.54469 au
magnitude: 3.92629 debye
