program: Orca
programVersion: 5.0.2
elementType: O O C C C C C C C C C C C C C C C C C C H H H H H H H H H H H H H H H H H H H H H H H H H H H H
charge: 0
multiplicity: 1
keywords: wb97x-d3
keywords: def2-TZVPP
keywords: def2/J RIJCOSX
keywords: DEFGRID2
keywords: scfconv7
keywords: smallprint printgap noloewdin
keywords: NOSOSCF
formula: C18H28O2
InChI: InChI=1/C18H28O2/c1-6-13-20-18(19)14-17(5)12-8-11-16(4)10-7-9-15(2)3/h1,8,12,14-16H,7,9-11,13H2,2-5H3
48 atoms
O  3.905814 -0.688373 0.07628
O  3.264984 -2.462862 1.274581
C  -3.962491 -0.159093 -0.528015
C  -3.211202 1.103375 -0.100535
C  -2.636098 1.92445 -1.249089
C  -1.725979 3.06367 -0.796044
C  -2.341902 4.075847 0.17155
C  -3.051291 -1.189157 -1.225125
C  -4.693295 -0.774278 0.66054
C  -1.308328 5.130255 0.550655
C  -3.589498 4.73399 -0.404698
C  -1.927418 -1.667204 -0.369042
C  -0.647478 -1.339817 -0.580759
C  0.486814 -1.774042 0.228859
C  0.213581 -2.694994 1.374086
C  1.696469 -1.280322 -0.117637
C  2.984888 -1.570842 0.504719
C  5.236488 -0.845845 0.558618
C  5.91945 -1.95948 -0.086746
C  6.503309 -2.855946 -0.632748
H  -4.715396 0.130856 -1.269786
H  -3.901589 1.727259 0.476008
H  -2.409252 0.829194 0.594759
H  -2.054589 1.281513 -1.915408
H  -3.457583 2.313932 -1.858763
H  -1.368054 3.603021 -1.680529
H  -0.835321 2.630985 -0.326795
H  -2.629922 3.549907 1.088535
H  -2.653963 -0.7677 -2.150507
H  -3.668859 -2.045971 -1.512625
H  -5.436859 -0.08235 1.059635
H  -5.214184 -1.692067 0.38102
H  -4.008644 -1.017483 1.475871
H  -0.993619 5.704469 -0.324519
H  -0.414792 4.677342 0.984816
H  -1.70663 5.836884 1.281133
H  -3.365696 5.242823 -1.346079
H  -4.383535 4.011956 -0.60181
H  -3.994808 5.479078 0.282679
H  -2.191337 -2.302326 0.471012
H  -0.41037 -0.697425 -1.424634
H  -0.21345 -3.631989 1.012315
H  -0.527603 -2.25133 2.040731
H  1.094577 -2.92889 1.958606
H  1.73732 -0.578509 -0.942604
H  5.256368 -0.961085 1.644187
H  5.745227 0.087321 0.318471
H  7.005491 -3.66457 -1.115381
elementType: O C H
totalener: -853.23239736 hartree
nucrepener: 1479.62774420 hartree
electener: -2332.86014157 hartree
oneelecener: -4093.67622445 hartree
twoeener: 1760.81608288 hartree
cpcmener: -0.02658948 hartree
kineticenergy: 849.15283690 hartree
xcener: -85.611761062317 hartree
chargesum: -0.0000000
charge: -0.283997 -0.492604 0.113630 -0.210711 -0.139518 -0.193489 0.079534 -0.146349 -0.321336 -0.299189 -0.310257 -0.120055 -0.164371 0.019531 -0.260907 -0.181174 0.479671 0.035565 -0.427985 0.034494 0.043008 0.081150 0.078504 0.082079 0.078032 0.077551 0.072329 0.033262 0.095171 0.101572 0.092619 0.096121 0.082664 0.081070 0.088195 0.089875 0.085735 0.087022 0.092597 0.130573 0.115182 0.111150 0.106064 0.104228 0.121318 0.138882 0.138346 0.285220
qa: -0.2840 -0.4926 0.1136 -0.2107 -0.1395 -0.1935 0.0795 -0.1463 -0.3213 -0.2992 -0.3103 -0.1201 -0.1644 0.0195 -0.2609 -0.1812 0.4797 0.0356 -0.4280 0.0345 0.0430 0.0811 0.0785 0.0821 0.0780 0.0776 0.0723 0.0333 0.0952 0.1016 0.0926 0.0961 0.0827 0.0811 0.0882 0.0899 0.0857 0.0870 0.0926 0.1306 0.1152 0.1111 0.1061 0.1042 0.1213 0.1389 0.1383 0.2852
va: 2.1220 2.0060 3.7657 3.9092 3.8616 3.9085 3.7799 3.9150 3.9493 3.9280 3.9357 3.8319 3.9055 3.7231 3.9294 3.7825 4.1394 3.8997 3.7180 3.6368 1.0173 1.0067 1.0046 1.0146 1.0061 1.0105 1.0087 1.0153 1.0065 1.0057 1.0052 1.0036 0.9974 1.0039 1.0044 1.0044 1.0021 1.0011 1.0050 0.9935 1.0217 0.9961 0.9951 1.0298 1.0305 1.0008 0.9896 0.9461
dispcorr: -0.020135707 hartree
energy: -853.252533071278
dipole: -37.34360 36.04786 -1.29574 23.17833 -22.46643 0.71190 -0.88235 0.44460 -0.43775
magnitude: 1.54188 au
magnitude: 3.91914 debye
