program: Orca
programVersion: 5.0.2
elementType: O O C C C C C C C C C C C C C C C C C C H H H H H H H H H H H H H H H H H H H H H H H H H H H H
charge: 0
multiplicity: 1
keywords: wb97x-d3
keywords: def2-TZVPP
keywords: def2/J RIJCOSX
keywords: DEFGRID2
keywords: scfconv7
keywords: smallprint printgap noloewdin
keywords: NOSOSCF
formula: C18H28O2
InChI: InChI=1/C18H28O2/c1-6-13-20-18(19)14-17(5)12-8-11-16(4)10-7-9-15(2)3/h1,8,12,14-16H,7,9-11,13H2,2-5H3
48 atoms
O  4.273978 -2.356571 -0.617309
O  4.124898 -1.559869 1.465793
C  -3.190763 -0.237043 -0.614313
C  -3.252956 1.138622 0.05004
C  -3.672653 2.270829 -0.881111
C  -3.560789 3.637065 -0.215452
C  -4.042352 4.81209 -1.068119
C  -2.681608 -1.316944 0.357094
C  -4.540832 -0.665733 -1.176809
C  -4.045263 6.095683 -0.245202
C  -3.200834 4.990884 -2.327221
C  -1.312947 -1.046516 0.887872
C  -0.207465 -1.599628 0.377053
C  1.15363 -1.36082 0.84679
C  1.333213 -0.462518 2.027802
C  2.146788 -1.965029 0.15771
C  3.577397 -1.913435 0.444705
C  5.691642 -2.411013 -0.490147
C  6.118523 -3.494098 0.386251
C  6.479904 -4.398802 1.088562
H  -2.474035 -0.181506 -1.442722
H  -3.938319 1.092568 0.904898
H  -2.269288 1.383536 0.464193
H  -3.051056 2.237856 -1.781473
H  -4.703783 2.123096 -1.216035
H  -2.519474 3.81582 0.078427
H  -4.137647 3.6201 0.715956
H  -5.074557 4.604979 -1.375573
H  -2.687932 -2.279421 -0.16056
H  -3.386057 -1.397174 1.191483
H  -5.303613 -0.680232 -0.394257
H  -4.888464 0.002634 -1.964723
H  -4.487417 -1.668644 -1.604248
H  -3.036936 6.345911 0.094053
H  -4.67623 6.000828 0.640615
H  -4.416441 6.942754 -0.82505
H  -3.25597 4.126252 -2.989642
H  -3.530337 5.858785 -2.901541
H  -2.148951 5.145701 -2.073088
H  -1.236426 -0.349124 1.71556
H  -0.310016 -2.293257 -0.453201
H  0.843362 0.495049 1.845447
H  2.370854 -0.267989 2.268726
H  0.855453 -0.896107 2.908102
H  1.875657 -2.550053 -0.713536
H  6.09648 -1.457292 -0.145403
H  6.067135 -2.581983 -1.498553
H  6.801114 -5.207813 1.705923
elementType: O C H
totalener: -853.23346690 hartree
nucrepener: 1420.34003983 hartree
electener: -2273.57350674 hartree
oneelecener: -3975.11605080 hartree
twoeener: 1701.54254406 hartree
cpcmener: -0.02673989 hartree
kineticenergy: 849.15720153 hartree
xcener: -85.609038593702 hartree
chargesum: 0.0000000
charge: -0.284183 -0.492332 0.108579 -0.183883 -0.120966 -0.159380 0.076347 -0.142082 -0.329059 -0.298583 -0.306828 -0.130101 -0.143651 0.009466 -0.258923 -0.181816 0.480869 0.036980 -0.427744 0.032511 0.043918 0.071447 0.072671 0.067637 0.066797 0.065617 0.068597 0.025804 0.085977 0.095928 0.087667 0.093803 0.092491 0.080475 0.087840 0.090162 0.090390 0.091306 0.082390 0.133101 0.115989 0.103763 0.103570 0.112173 0.122031 0.138823 0.138332 0.286079
qa: -0.2842 -0.4923 0.1086 -0.1839 -0.1210 -0.1594 0.0763 -0.1421 -0.3291 -0.2986 -0.3068 -0.1301 -0.1437 0.0095 -0.2589 -0.1818 0.4809 0.0370 -0.4277 0.0325 0.0439 0.0714 0.0727 0.0676 0.0668 0.0656 0.0686 0.0258 0.0860 0.0959 0.0877 0.0938 0.0925 0.0805 0.0878 0.0902 0.0904 0.0913 0.0824 0.1331 0.1160 0.1038 0.1036 0.1122 0.1220 0.1388 0.1383 0.2861
va: 2.1221 2.0048 3.7772 3.9119 3.8726 3.8888 3.8132 3.9164 3.9524 3.9302 3.9284 3.8757 3.8895 3.7342 3.9343 3.7928 4.1322 3.8988 3.7081 3.6389 1.0229 1.0101 1.0102 1.0081 1.0084 1.0124 1.0112 1.0189 1.0144 1.0067 1.0002 1.0008 1.0049 1.0030 1.0046 1.0049 1.0022 1.0041 1.0026 0.9929 1.0221 0.9959 1.0285 0.9957 1.0295 0.9995 0.9898 0.9457
dispcorr: -0.018278362 hartree
energy: -853.251745264341
dipole: -43.69336 42.34477 -1.34858 30.47432 -30.25252 0.22180 -6.72933 5.98547 -0.74386
magnitude: 1.55602 au
magnitude: 3.95509 debye
