program: Orca
programVersion: 5.0.2
elementType: O O C C C C C C C C C C C C C C C C C C H H H H H H H H H H H H H H H H H H H H H H H H H H H H
charge: 0
multiplicity: 1
keywords: wb97x-d3
keywords: def2-TZVPP
keywords: def2/J RIJCOSX
keywords: DEFGRID2
keywords: scfconv7
keywords: smallprint printgap noloewdin
keywords: NOSOSCF
formula: C18H28O2
InChI: InChI=1/C18H28O2/c1-6-13-20-18(19)14-17(5)12-8-11-16(4)10-7-9-15(2)3/h1,8,12,14-16H,7,9-11,13H2,2-5H3
48 atoms
O  4.156163 -2.075239 1.831443
O  4.222395 -1.434092 -0.310359
C  -3.434798 -0.056541 0.522152
C  -3.554111 1.033802 -0.544113
C  -4.572846 2.114929 -0.200323
C  -4.816721 3.112841 -1.329043
C  -3.599834 3.923638 -1.781962
C  -2.663516 -1.284727 0.005919
C  -2.824714 0.468901 1.816284
C  -3.996068 4.866658 -2.911732
C  -2.969411 4.701967 -0.633253
C  -1.249695 -0.995503 -0.367649
C  -0.195664 -1.449079 0.319727
C  1.204434 -1.208813 -0.014501
C  1.501278 -0.377568 -1.220874
C  2.122152 -1.751845 0.815806
C  3.573859 -1.711861 0.674244
C  5.579011 -2.139402 1.857283
C  6.089033 -3.294218 1.12963
C  6.526708 -4.254079 0.555496
H  -4.446866 -0.413148 0.745884
H  -2.571673 1.487914 -0.711854
H  -3.841929 0.572651 -1.495888
H  -5.525209 1.633972 0.04572
H  -4.268167 2.64772 0.704587
H  -5.59999 3.813254 -1.017131
H  -5.220392 2.574659 -2.193743
H  -2.84666 3.232424 -2.17638
H  -3.188544 -1.675896 -0.871596
H  -2.689306 -2.066658 0.769251
H  -1.841372 0.911893 1.644055
H  -3.45215 1.233514 2.275451
H  -2.70137 -0.330628 2.549564
H  -4.737824 5.594584 -2.573058
H  -4.429826 4.322864 -3.753333
H  -3.136645 5.424822 -3.287945
H  -2.13901 5.317371 -0.98471
H  -3.69792 5.36946 -0.165259
H  -2.575945 4.046017 0.144941
H  -1.097305 -0.37648 -1.246358
H  -0.37588 -2.067791 1.194553
H  2.549926 -0.125226 -1.323514
H  0.932945 0.552513 -1.18176
H  1.187073 -0.899111 -2.127058
H  1.762446 -2.283631 1.689114
H  5.8463 -2.219779 2.910557
H  6.025914 -1.219737 1.474111
H  6.910796 -5.106817 0.041216
elementType: O C H
totalener: -853.23275414 hartree
nucrepener: 1444.33780855 hartree
electener: -2297.57056269 hartree
oneelecener: -4023.06591686 hartree
twoeener: 1725.49535417 hartree
cpcmener: -0.02700379 hartree
kineticenergy: 849.15625473 hartree
xcener: -85.611223659383 hartree
chargesum: 0.0000000
charge: -0.283968 -0.492698 0.139965 -0.207484 -0.132564 -0.191564 0.071262 -0.135038 -0.346210 -0.300904 -0.306800 -0.136460 -0.150342 0.020247 -0.260167 -0.180371 0.476889 0.034387 -0.427541 0.034059 0.042617 0.071706 0.081125 0.078888 0.073059 0.077578 0.073586 0.034834 0.094963 0.088937 0.084139 0.100159 0.098359 0.080413 0.088806 0.089901 0.092314 0.086073 0.086533 0.130698 0.114553 0.102300 0.103124 0.115018 0.122161 0.138073 0.139587 0.285791
qa: -0.2840 -0.4927 0.1400 -0.2075 -0.1326 -0.1916 0.0713 -0.1350 -0.3462 -0.3009 -0.3068 -0.1365 -0.1503 0.0202 -0.2602 -0.1804 0.4769 0.0344 -0.4275 0.0341 0.0426 0.0717 0.0811 0.0789 0.0731 0.0776 0.0736 0.0348 0.0950 0.0889 0.0841 0.1002 0.0984 0.0804 0.0888 0.0899 0.0923 0.0861 0.0865 0.1307 0.1146 0.1023 0.1031 0.1150 0.1222 0.1381 0.1396 0.2858
va: 2.1219 2.0045 3.7302 3.9284 3.8724 3.9095 3.7799 3.9333 3.9628 3.9307 3.9329 3.8626 3.8737 3.7339 3.9372 3.7920 4.1357 3.9002 3.7109 3.6369 1.0179 0.9999 1.0090 1.0125 1.0019 1.0105 1.0093 1.0153 1.0067 1.0127 0.9980 1.0035 1.0036 1.0040 1.0040 1.0045 1.0054 1.0023 1.0009 0.9974 1.0230 1.0258 0.9961 0.9948 1.0294 0.9898 0.9992 0.9458
dispcorr: -0.019549992 hartree
energy: -853.252304131852
dipole: -42.35376 40.93214 -1.42162 28.57496 -28.37361 0.20135 -8.31297 8.80443 0.49146
magnitude: 1.51759 au
magnitude: 3.85742 debye
