program: Orca
programVersion: 5.0.2
elementType: O O C C C C C C C C C C C C C C C C C C H H H H H H H H H H H H H H H H H H H H H H H H H H H H
charge: 0
multiplicity: 1
keywords: wb97x-d3
keywords: def2-TZVPP
keywords: def2/J RIJCOSX
keywords: DEFGRID2
keywords: scfconv7
keywords: smallprint printgap noloewdin
keywords: NOSOSCF
formula: C18H28O2
InChI: InChI=1/C18H28O2/c1-6-13-20-18(19)14-17(5)12-8-11-16(4)10-7-9-15(2)3/h1,8,12,14-16H,7,9-11,13H2,2-5H3
48 atoms
O  4.97724 -1.72942 0.360583
O  3.925539 -3.682413 0.088997
C  -2.448256 0.709839 -0.268302
C  -3.345919 1.841063 0.235821
C  -3.7692 2.846808 -0.828502
C  -4.541029 4.020363 -0.23568
C  -4.8717 5.141179 -1.221922
C  -1.903024 -0.078323 0.935935
C  -3.170165 -0.199755 -1.254738
C  -5.781274 4.668787 -2.351165
C  -5.502921 6.319849 -0.489417
C  -0.926049 -1.140682 0.560241
C  0.395789 -1.012418 0.72141
C  1.395553 -2.013528 0.362098
C  0.908687 -3.309249 -0.201865
C  2.688902 -1.671406 0.556938
C  3.869835 -2.491616 0.304124
C  6.228985 -2.381669 0.170533
C  6.604897 -3.188195 1.324644
C  6.92878 -3.835528 2.282964
H  -1.589386 1.16126 -0.779473
H  -4.235618 1.409827 0.710011
H  -2.814269 2.379861 1.027676
H  -2.877294 3.224288 -1.341557
H  -4.374431 2.352018 -1.592009
H  -3.954438 4.443205 0.587338
H  -5.472147 3.655773 0.21494
H  -3.929522 5.484504 -1.665986
H  -2.747862 -0.532845 1.46478
H  -1.430667 0.622389 1.629104
H  -2.512078 -0.972485 -1.655139
H  -4.01545 -0.700988 -0.776057
H  -3.557403 0.358339 -2.107638
H  -6.031254 5.49041 -3.02506
H  -6.719762 4.271145 -1.955975
H  -5.319813 3.885958 -2.954372
H  -6.453332 6.034237 -0.031461
H  -4.853712 6.69181 0.30567
H  -5.702668 7.152056 -1.166879
H  -1.332434 -2.046656 0.122409
H  0.777704 -0.09557 1.162023
H  0.303857 -3.837869 0.537223
H  1.706017 -3.969332 -0.520027
H  0.261018 -3.123851 -1.059949
H  2.896293 -0.676433 0.933353
H  6.95382 -1.580738 0.028054
H  6.227179 -2.989282 -0.736618
H  7.218255 -4.411971 3.133307
elementType: O C H
totalener: -853.23389086 hartree
nucrepener: 1394.20578195 hartree
electener: -2247.43967281 hartree
oneelecener: -3922.83526236 hartree
twoeener: 1675.39558955 hartree
cpcmener: -0.02673243 hartree
kineticenergy: 849.15275499 hartree
xcener: -85.608296713866 hartree
chargesum: 0.0000000
charge: -0.284185 -0.492739 0.128618 -0.192744 -0.115478 -0.159912 0.075889 -0.129802 -0.331913 -0.306447 -0.300207 -0.136418 -0.145659 0.010774 -0.260460 -0.182842 0.481751 0.036233 -0.426692 0.031582 0.040632 0.069941 0.072353 0.061448 0.068954 0.068320 0.066065 0.025557 0.094321 0.082612 0.093145 0.086072 0.094981 0.091132 0.082254 0.090245 0.080846 0.088084 0.090291 0.132432 0.115306 0.112420 0.104037 0.104610 0.120974 0.138356 0.139465 0.285800
qa: -0.2842 -0.4927 0.1286 -0.1927 -0.1155 -0.1599 0.0759 -0.1298 -0.3319 -0.3064 -0.3002 -0.1364 -0.1457 0.0108 -0.2605 -0.1828 0.4818 0.0362 -0.4267 0.0316 0.0406 0.0699 0.0724 0.0614 0.0690 0.0683 0.0661 0.0256 0.0943 0.0826 0.0931 0.0861 0.0950 0.0911 0.0823 0.0902 0.0808 0.0881 0.0903 0.1324 0.1153 0.1124 0.1040 0.1046 0.1210 0.1384 0.1395 0.2858
va: 2.1218 2.0054 3.7609 3.9361 3.8661 3.8866 3.8128 3.9319 3.9581 3.9291 3.9326 3.8765 3.9052 3.7324 3.9338 3.7873 4.1363 3.8983 3.7115 3.6405 1.0243 1.0091 1.0117 1.0101 1.0071 1.0123 1.0108 1.0185 1.0060 1.0163 1.0019 1.0006 1.0024 1.0047 1.0025 1.0017 1.0030 1.0047 1.0048 0.9945 1.0225 0.9954 1.0297 0.9959 1.0302 0.9896 0.9992 0.9459
dispcorr: -0.018056026 hartree
energy: -853.251946881498
dipole: -50.27708 49.30392 -0.97317 31.69598 -30.56089 1.13509 -9.37886 9.24113 -0.13773
magnitude: 1.50148 au
magnitude: 3.81647 debye
