program: Orca
programVersion: 5.0.2
elementType: O O C C C C C C C C C C C C C C C C C C H H H H H H H H H H H H H H H H H H H H H H H H H H H H
charge: 0
multiplicity: 1
keywords: wb97x-d3
keywords: def2-TZVPP
keywords: def2/J RIJCOSX
keywords: DEFGRID2
keywords: scfconv7
keywords: smallprint printgap noloewdin
keywords: NOSOSCF
formula: C18H28O2
InChI: InChI=1/C18H28O2/c1-6-13-20-18(19)14-17(5)12-8-11-16(4)10-7-9-15(2)3/h1,8,12,14-16H,7,9-11,13H2,2-5H3
48 atoms
O  4.332241 -3.331726 0.096514
O  4.578959 -1.385767 1.166731
C  -2.538687 1.025938 -0.706257
C  -3.981353 0.916807 -1.203651
C  -4.581306 2.195774 -1.78286
C  -4.553581 3.402723 -0.848079
C  -5.222998 3.204542 0.512874
C  -2.1172 -0.317285 -0.090223
C  -1.582386 1.449934 -1.813751
C  -5.063959 4.459489 1.363104
C  -6.695774 2.835116 0.380022
C  -0.754848 -0.289929 0.511028
C  0.240086 -1.10883 0.152082
C  1.589915 -1.094234 0.707329
C  1.894498 -0.085723 1.767806
C  2.458074 -2.006388 0.215732
C  3.867285 -2.159254 0.564535
C  5.7098 -3.620094 0.314136
C  6.575774 -2.815975 -0.538533
C  7.293045 -2.168305 -1.25134
H  -2.497488 1.778924 0.089709
H  -4.025864 0.133723 -1.9688
H  -4.609245 0.562158 -0.379659
H  -4.060991 2.461575 -2.707198
H  -5.611865 1.985154 -2.082284
H  -5.037137 4.246427 -1.353754
H  -3.515508 3.711951 -0.685464
H  -4.714206 2.385306 1.03373
H  -2.177258 -1.104638 -0.847877
H  -2.83922 -0.574093 0.693248
H  -1.85314 2.419119 -2.234302
H  -0.55694 1.535282 -1.450648
H  -1.582565 0.722964 -2.630282
H  -5.500506 4.328301 2.355049
H  -5.558097 5.315483 0.896599
H  -4.012448 4.720573 1.498342
H  -6.840901 1.893864 -0.152456
H  -7.16399 2.726106 1.3601
H  -7.245425 3.608535 -0.162858
H  -0.593072 0.457428 1.282962
H  0.051843 -1.844669 -0.624651
H  2.879988 -0.199308 2.201617
H  1.160579 -0.157427 2.571211
H  1.816986 0.924931 1.362826
H  2.090152 -2.711263 -0.52085
H  5.827199 -4.675557 0.070791
H  5.982503 -3.491865 1.363659
H  7.930081 -1.594581 -1.886779
elementType: O C H
totalener: -853.23351552 hartree
nucrepener: 1432.77867945 hartree
electener: -2286.01219497 hartree
oneelecener: -3999.90844673 hartree
twoeener: 1713.89625176 hartree
cpcmener: -0.02696171 hartree
kineticenergy: 849.15618634 hartree
xcener: -85.612835302033 hartree
chargesum: -0.0000000
charge: -0.284701 -0.493257 0.080485 -0.180375 -0.184305 -0.168265 0.056474 -0.103922 -0.342995 -0.292089 -0.305440 -0.152468 -0.133939 0.012753 -0.260940 -0.185098 0.483301 0.038999 -0.428109 0.032082 0.050463 0.087801 0.079557 0.083823 0.084308 0.083229 0.075476 0.033400 0.080232 0.096324 0.096215 0.098292 0.088792 0.090252 0.080267 0.089222 0.086268 0.092362 0.085300 0.129545 0.115230 0.104195 0.105081 0.112419 0.121719 0.137839 0.139048 0.285151
qa: -0.2847 -0.4933 0.0805 -0.1804 -0.1843 -0.1683 0.0565 -0.1039 -0.3430 -0.2921 -0.3054 -0.1525 -0.1339 0.0128 -0.2609 -0.1851 0.4833 0.0390 -0.4281 0.0321 0.0505 0.0878 0.0796 0.0838 0.0843 0.0832 0.0755 0.0334 0.0802 0.0963 0.0962 0.0983 0.0888 0.0903 0.0803 0.0892 0.0863 0.0924 0.0853 0.1295 0.1152 0.1042 0.1051 0.1124 0.1217 0.1378 0.1390 0.2852
va: 2.1215 2.0039 3.7229 3.8714 3.9189 3.8595 3.7925 3.9023 3.9670 3.9202 3.9390 3.8984 3.9027 3.7348 3.9322 3.7912 4.1342 3.8986 3.7106 3.6409 1.0192 1.0097 1.0041 1.0030 1.0020 1.0107 1.0045 1.0155 1.0171 1.0062 1.0021 1.0022 1.0025 1.0046 1.0041 1.0043 1.0024 1.0050 1.0028 1.0025 1.0227 1.0280 0.9958 0.9955 1.0299 0.9898 0.9998 0.9463
dispcorr: -0.019672440 hartree
energy: -853.253187960845
dipole: -48.91786 47.44650 -1.47136 27.64217 -27.81768 -0.17551 -2.35826 2.18022 -0.17804
magnitude: 1.49245 au
magnitude: 3.79351 debye
