program: Orca
programVersion: 5.0.2
elementType: O O C C C C C C C C C C C C C C C C C C H H H H H H H H H H H H H H H H H H H H H H H H H H H H
charge: 0
multiplicity: 1
keywords: wb97x-d3
keywords: def2-TZVPP
keywords: def2/J RIJCOSX
keywords: DEFGRID2
keywords: scfconv7
keywords: smallprint printgap noloewdin
keywords: NOSOSCF
formula: C18H28O2
InChI: InChI=1/C18H28O2/c1-6-13-20-18(19)14-17(5)12-8-11-16(4)10-7-9-15(2)3/h1,8,12,14-16H,7,9-11,13H2,2-5H3
48 atoms
O  3.973347 -0.645888 0.753565
O  3.487935 -2.390493 -0.554911
C  -4.006573 -0.272102 -0.003374
C  -3.259092 0.893788 -0.65787
C  -2.72492 1.952096 0.301732
C  -1.797491 2.963448 -0.3675
C  -2.396981 3.763302 -1.526206
C  -3.12343 -1.083465 0.959819
C  -5.272943 0.182214 0.712795
C  -3.632479 4.54753 -1.099948
C  -1.345598 4.698352 -2.113211
C  -1.875328 -1.582678 0.319407
C  -0.642977 -1.226231 0.698965
C  0.598093 -1.690541 0.086659
C  0.491657 -2.666995 -1.039577
C  1.74675 -1.182353 0.587075
C  3.109891 -1.500273 0.174318
C  5.360722 -0.847139 0.503138
C  5.881449 -2.007799 1.214142
C  6.322177 -2.948765 1.816252
H  -4.30778 -0.947226 -0.812581
H  -2.424131 0.495772 -1.244661
H  -3.932326 1.362694 -1.38217
H  -3.555263 2.470704 0.789117
H  -2.16268 1.472563 1.108382
H  -0.909387 2.433873 -0.730095
H  -1.438583 3.669049 0.390416
H  -2.695237 3.063559 -2.314889
H  -3.708136 -1.941352 1.30915
H  -2.881337 -0.490501 1.845583
H  -5.048032 0.810818 1.576642
H  -5.919416 0.755974 0.04619
H  -5.848415 -0.671882 1.074389
H  -3.397292 5.233617 -0.282083
H  -4.439243 3.895374 -0.76127
H  -4.024983 5.143298 -1.926238
H  -0.463327 4.147962 -2.446009
H  -1.734222 5.248042 -2.972553
H  -1.015712 5.432633 -1.374005
H  -2.012102 -2.262582 -0.516722
H  -0.535508 -0.537054 1.532106
H  0.051489 -3.601043 -0.686245
H  1.442218 -2.896284 -1.504142
H  -0.176112 -2.278235 -1.809156
H  1.670377 -0.452377 1.384371
H  5.853689 0.057046 0.85933
H  5.563883 -0.932933 -0.566555
H  6.717291 -3.780063 2.354976
elementType: O C H
totalener: -853.23275208 hartree
nucrepener: 1478.40088178 hartree
electener: -2331.63363386 hartree
oneelecener: -4091.27680963 hartree
twoeener: 1759.64317577 hartree
cpcmener: -0.02674872 hartree
kineticenergy: 849.15838635 hartree
xcener: -85.613484389043 hartree
chargesum: 0.0000000
charge: -0.284739 -0.494058 0.088553 -0.182519 -0.160277 -0.193047 0.075673 -0.151036 -0.333386 -0.306892 -0.300074 -0.109096 -0.164971 0.020480 -0.261100 -0.189697 0.486229 0.036200 -0.426876 0.031397 0.054185 0.085315 0.087786 0.082934 0.086575 0.072701 0.077570 0.034855 0.099724 0.084231 0.084850 0.094256 0.096539 0.084720 0.086329 0.092726 0.088691 0.090485 0.080485 0.129916 0.118344 0.112856 0.104691 0.104968 0.120356 0.138083 0.139034 0.286031
qa: -0.2847 -0.4941 0.0886 -0.1825 -0.1603 -0.1930 0.0757 -0.1510 -0.3334 -0.3069 -0.3001 -0.1091 -0.1650 0.0205 -0.2611 -0.1897 0.4862 0.0362 -0.4269 0.0314 0.0542 0.0853 0.0878 0.0829 0.0866 0.0727 0.0776 0.0349 0.0997 0.0842 0.0848 0.0943 0.0965 0.0847 0.0863 0.0927 0.0887 0.0905 0.0805 0.1299 0.1183 0.1129 0.1047 0.1050 0.1204 0.1381 0.1390 0.2860
va: 2.1209 2.0046 3.7918 3.8863 3.8596 3.9111 3.7817 3.9296 3.9491 3.9336 3.9301 3.8461 3.8956 3.7222 3.9275 3.7828 4.1385 3.8993 3.7083 3.6399 1.0133 1.0064 1.0067 1.0002 1.0102 1.0098 1.0099 1.0158 1.0069 1.0052 0.9966 1.0036 1.0040 1.0028 1.0015 1.0051 1.0045 1.0042 1.0041 1.0011 1.0201 0.9956 1.0301 0.9962 1.0310 0.9897 0.9996 0.9457
dispcorr: -0.020236187 hartree
energy: -853.252988264272
dipole: -38.55391 37.19891 -1.35500 23.27402 -22.64093 0.63309 -6.89232 7.12779 0.23547
magnitude: 1.51403 au
magnitude: 3.84836 debye
