program: Orca
programVersion: 5.0.2
elementType: O O C C C C C C C C C C C C C C C C C C H H H H H H H H H H H H H H H H H H H H H H H H H H H H
charge: 0
multiplicity: 1
keywords: wb97x-d3
keywords: def2-TZVPP
keywords: def2/J RIJCOSX
keywords: DEFGRID2
keywords: scfconv7
keywords: smallprint printgap noloewdin
keywords: NOSOSCF
formula: C18H28O2
InChI: InChI=1/C18H28O2/c1-6-13-20-18(19)14-17(5)12-8-11-16(4)10-7-9-15(2)3/h1,8,12,14-16H,7,9-11,13H2,2-5H3
48 atoms
O  4.223742 -2.53808 1.134857
O  4.32743 -0.61581 0.00363
C  -3.325387 -0.012497 0.891246
C  -3.295963 1.478189 0.550901
C  -3.857809 1.839574 -0.818557
C  -3.944693 3.346832 -1.026307
C  -4.586355 3.78228 -2.344424
C  -2.577928 -0.890755 -0.131181
C  -2.79758 -0.246408 2.301241
C  -4.774392 5.29505 -2.366386
C  -3.778679 3.332166 -3.556827
C  -1.155616 -0.491034 -0.326165
C  -0.10978 -1.195385 0.12082
C  1.290878 -0.814342 -0.038046
C  1.580416 0.453185 -0.775282
C  2.207704 -1.647624 0.503639
C  3.660857 -1.502812 0.492767
C  5.64826 -2.557231 1.210288
C  6.025328 -3.702966 2.021916
C  6.37484 -4.63383 2.694435
H  -4.371238 -0.33855 0.86531
H  -3.868314 2.00925 1.318985
H  -2.270031 1.85468 0.635115
H  -3.240661 1.392259 -1.60267
H  -4.856383 1.401306 -0.928423
H  -2.940449 3.782865 -0.958554
H  -4.517522 3.780499 -0.199179
H  -5.57786 3.31731 -2.404334
H  -3.094572 -0.836285 -1.093827
H  -2.63235 -1.932231 0.195708
H  -1.761471 0.083078 2.403766
H  -3.388679 0.304419 3.034999
H  -2.83619 -1.302746 2.574144
H  -3.812053 5.810028 -2.307918
H  -5.380938 5.636189 -1.525128
H  -5.267447 5.624705 -3.282781
H  -3.686948 2.246973 -3.615284
H  -4.24465 3.666859 -4.485623
H  -2.767976 3.747774 -3.527394
H  -0.987873 0.440727 -0.857657
H  -0.295555 -2.125512 0.650912
H  1.153108 0.408654 -1.778345
H  2.637155 0.668726 -0.867282
H  1.103594 1.295456 -0.270737
H  1.843649 -2.533527 1.010722
H  6.030421 -1.640965 1.666552
H  6.088213 -2.642746 0.21344
H  6.676757 -5.460564 3.297902
elementType: O C H
totalener: -853.23379858 hartree
nucrepener: 1430.81473996 hartree
electener: -2284.04853854 hartree
oneelecener: -3995.69905682 hartree
twoeener: 1711.65051827 hartree
cpcmener: -0.02434188 hartree
kineticenergy: 849.15029265 hartree
xcener: -85.609426591598 hartree
chargesum: -0.0000000
charge: -0.276532 -0.500209 0.114073 -0.197119 -0.118320 -0.161370 0.079325 -0.141814 -0.337046 -0.300292 -0.306835 -0.121314 -0.175588 0.029065 -0.261365 -0.168851 0.476533 0.009703 -0.471444 0.113146 0.044559 0.078185 0.074532 0.063353 0.069343 0.066816 0.068848 0.025166 0.102551 0.092759 0.083107 0.096219 0.096265 0.080534 0.087986 0.090438 0.089141 0.092186 0.082792 0.130110 0.116614 0.107647 0.108067 0.107237 0.118526 0.127920 0.130775 0.284580
qa: -0.2765 -0.5002 0.1141 -0.1971 -0.1183 -0.1614 0.0793 -0.1418 -0.3370 -0.3003 -0.3068 -0.1213 -0.1756 0.0291 -0.2614 -0.1689 0.4765 0.0097 -0.4714 0.1131 0.0446 0.0782 0.0745 0.0634 0.0693 0.0668 0.0688 0.0252 0.1026 0.0928 0.0831 0.0962 0.0963 0.0805 0.0880 0.0904 0.0891 0.0922 0.0828 0.1301 0.1166 0.1076 0.1081 0.1072 0.1185 0.1279 0.1308 0.2846
va: 2.1207 2.0053 3.7663 3.8847 3.8618 3.8855 3.8105 3.9281 3.9591 3.9310 3.9276 3.8488 3.9110 3.6957 3.9227 3.7980 4.1320 3.9561 3.9006 3.5013 1.0155 1.0126 1.0020 1.0047 1.0118 1.0109 1.0123 1.0186 1.0010 1.0131 0.9989 1.0053 1.0037 1.0030 1.0048 1.0047 1.0025 1.0041 1.0027 0.9901 1.0227 0.9959 1.0342 0.9963 1.0314 0.9912 0.9884 0.9454
dispcorr: -0.019002599 hartree
energy: -853.252801182527
dipole: -43.38424 41.90041 -1.48383 26.79857 -26.94777 -0.14921 -11.00563 11.05167 0.04604
magnitude: 1.49202 au
magnitude: 3.79242 debye
