program: Orca
programVersion: 5.0.2
elementType: O O C C C C C C C C C C C C C C C C C C H H H H H H H H H H H H H H H H H H H H H H H H H H H H
charge: 0
multiplicity: 1
keywords: wb97x-d3
keywords: def2-TZVPP
keywords: def2/J RIJCOSX
keywords: DEFGRID2
keywords: scfconv7
keywords: smallprint printgap noloewdin
keywords: NOSOSCF
formula: C18H28O2
InChI: InChI=1/C18H28O2/c1-6-13-20-18(19)14-17(5)12-8-11-16(4)10-7-9-15(2)3/h1,8,12,14-16H,7,9-11,13H2,2-5H3
48 atoms
O  3.378105 -1.521629 -0.828958
O  2.774505 -1.151602 1.289706
C  -4.439614 -0.204099 -0.51816
C  -3.583802 0.966906 -1.023221
C  -2.546055 1.534633 -0.055031
C  -1.594959 2.502254 -0.750206
C  -0.491303 3.075601 0.141694
C  -3.737804 -1.569354 -0.676439
C  -4.967477 0.01454 0.895123
C  0.513728 2.009188 0.568764
C  0.225338 4.219158 -0.567753
C  -2.482632 -1.706089 0.1113
C  -1.263174 -1.812903 -0.429226
C  -0.019154 -1.766183 0.329149
C  -0.11147 -1.792596 1.821582
C  1.124438 -1.651088 -0.383467
C  2.461283 -1.423631 0.15089
C  4.735518 -1.279742 -0.471926
C  4.983615 0.125687 -0.176259
C  5.200822 1.284394 0.054253
H  -5.310333 -0.262006 -1.179129
H  -3.080242 0.653058 -1.944613
H  -4.253237 1.781358 -1.318484
H  -3.049808 2.056279 0.764803
H  -1.975769 0.727564 0.406323
H  -2.180224 3.328412 -1.169707
H  -1.128324 1.999563 -1.606436
H  -0.962409 3.482164 1.044866
H  -3.528811 -1.738246 -1.735795
H  -4.442527 -2.34683 -0.361539
H  -5.521808 0.952485 0.964766
H  -5.647167 -0.788716 1.185809
H  -4.171244 0.053018 1.640061
H  1.304323 2.438816 1.186992
H  0.990507 1.552337 -0.302651
H  0.050688 1.210665 1.149972
H  -0.467249 5.018539 -0.838003
H  1.00313 4.655817 0.06155
H  0.703186 3.872494 -1.487578
H  -2.587877 -1.665598 1.191138
H  -1.16857 -1.836041 -1.511267
H  -0.796948 -2.576738 2.143257
H  -0.516757 -0.847797 2.191644
H  0.842142 -1.959874 2.307191
H  1.056452 -1.683067 -1.464575
H  5.321643 -1.585044 -1.338237
H  5.041616 -1.905797 0.369028
H  5.400433 2.310225 0.270734
elementType: O C H
totalener: -853.22969619 hartree
nucrepener: 1566.51580056 hartree
electener: -2419.74549675 hartree
oneelecener: -4267.95479855 hartree
twoeener: 1848.20930180 hartree
cpcmener: -0.02768732 hartree
kineticenergy: 849.15823664 hartree
xcener: -85.614647174448 hartree
chargesum: 0.0000000
charge: -0.285901 -0.497224 0.084233 -0.205569 -0.109997 -0.158212 0.107014 -0.123852 -0.325913 -0.328590 -0.299503 -0.106067 -0.180246 0.021794 -0.270533 -0.207590 0.503976 0.036526 -0.417747 0.020324 0.052592 0.071734 0.090288 0.075837 0.034495 0.074797 0.064017 0.023183 0.084336 0.095406 0.098786 0.097956 0.078877 0.098333 0.081115 0.086472 0.088022 0.089352 0.081586 0.138396 0.115268 0.114382 0.116182 0.109299 0.119564 0.138266 0.140448 0.284087
qa: -0.2859 -0.4972 0.0842 -0.2056 -0.1100 -0.1582 0.1070 -0.1239 -0.3259 -0.3286 -0.2995 -0.1061 -0.1802 0.0218 -0.2705 -0.2076 0.5040 0.0365 -0.4177 0.0203 0.0526 0.0717 0.0903 0.0758 0.0345 0.0748 0.0640 0.0232 0.0843 0.0954 0.0988 0.0980 0.0789 0.0983 0.0811 0.0865 0.0880 0.0894 0.0816 0.1384 0.1153 0.1144 0.1162 0.1093 0.1196 0.1383 0.1404 0.2841
va: 2.1219 1.9861 3.7827 3.9427 3.8333 3.8866 3.8042 3.9322 3.9595 3.9597 3.9287 3.8303 3.8896 3.6791 3.9215 3.7825 4.0931 3.9022 3.6969 3.6562 1.0131 1.0091 1.0042 1.0110 1.0167 1.0103 1.0131 1.0192 1.0145 1.0068 1.0014 1.0050 0.9952 1.0073 0.9976 0.9949 1.0053 1.0052 1.0026 0.9912 1.0221 0.9982 0.9902 1.0252 1.0319 0.9898 0.9986 0.9476
dispcorr: -0.023638273 hartree
energy: -853.253334464245
dipole: -26.91546 25.56496 -1.35050 15.37417 -15.63223 -0.25805 0.94645 -1.56650 -0.62005
magnitude: 1.50828 au
magnitude: 3.83373 debye
