program: Orca
programVersion: 5.0.2
elementType: O O C C C C C C C C C C C C C C C C C C H H H H H H H H H H H H H H H H H H H H H H H H H H H H
charge: 0
multiplicity: 1
keywords: wb97x-d3
keywords: def2-TZVPP
keywords: def2/J RIJCOSX
keywords: DEFGRID2
keywords: scfconv7
keywords: smallprint printgap noloewdin
keywords: NOSOSCF
formula: C18H28O2
InChI: InChI=1/C18H28O2/c1-6-13-20-18(19)14-17(5)12-8-11-16(4)10-7-9-15(2)3/h1,8,12,14-16H,7,9-11,13H2,2-5H3
48 atoms
O  3.158392 -1.241408 1.204612
O  2.783671 -1.45739 -0.987106
C  -4.297263 0.027943 0.06729
C  -3.29074 1.063962 0.592136
C  -2.212978 1.491048 -0.402295
C  -1.151285 2.373251 0.244354
C  -0.019789 2.817503 -0.686116
C  -3.847081 -1.419111 0.356654
C  -5.676244 0.245893 0.680603
C  0.813723 3.911024 -0.026969
C  0.880224 1.652884 -1.084689
C  -2.536451 -1.75121 -0.26235
C  -1.391001 -1.867381 0.418749
C  -0.075696 -1.954157 -0.202734
C  -0.010093 -2.247508 -1.667903
C  0.986917 -1.685151 0.589147
C  2.359711 -1.480085 0.148109
C  4.500767 -0.854678 0.924732
C  4.563762 0.486588 0.356126
C  4.597788 1.597751 -0.098136
H  -4.386875 0.145779 -1.019038
H  -3.83265 1.961207 0.908235
H  -2.816606 0.674092 1.500593
H  -1.745162 0.612119 -0.849469
H  -2.683968 2.03497 -1.228137
H  -0.714257 1.843634 1.100029
H  -1.640861 3.261481 0.658959
H  -0.470507 3.234561 -1.594715
H  -4.612453 -2.100485 -0.027669
H  -3.799859 -1.561276 1.440271
H  -5.638045 0.1634 1.769359
H  -6.062409 1.237319 0.43909
H  -6.398334 -0.488209 0.318794
H  1.273016 3.547364 0.895928
H  0.207165 4.782152 0.227328
H  1.61953 4.249616 -0.681266
H  0.333882 0.855516 -1.590724
H  1.675346 1.979187 -1.758092
H  1.35482 1.223441 -0.1993
H  -2.530478 -1.820189 -1.346257
H  -1.409675 -1.763706 1.499971
H  0.971827 -2.569867 -1.993062
H  -0.279908 -1.360425 -2.246795
H  -0.72651 -3.026097 -1.929155
H  0.807722 -1.512645 1.643859
H  4.995134 -1.57232 0.266819
H  5.016752 -0.877634 1.883852
H  4.633091 2.58262 -0.507767
elementType: O C H
totalener: -853.23125067 hartree
nucrepener: 1583.90687370 hartree
electener: -2437.13812437 hartree
oneelecener: -4302.75236067 hartree
twoeener: 1865.61423629 hartree
cpcmener: -0.02753536 hartree
kineticenergy: 849.16587391 hartree
xcener: -85.613879207853 hartree
chargesum: 0.0000000
charge: -0.285915 -0.492968 0.079124 -0.180464 -0.128658 -0.169821 0.129017 -0.127520 -0.313495 -0.310122 -0.341285 -0.079695 -0.190438 0.031104 -0.272531 -0.201401 0.481041 0.052588 -0.399792 -0.005329 0.046805 0.083232 0.068428 0.056118 0.073170 0.064264 0.075584 0.026900 0.089388 0.080706 0.088226 0.089894 0.089618 0.080558 0.090572 0.091907 0.095764 0.103370 0.063077 0.132007 0.118115 0.108985 0.117080 0.114119 0.118510 0.138663 0.139123 0.282374
qa: -0.2859 -0.4930 0.0791 -0.1805 -0.1287 -0.1698 0.1290 -0.1275 -0.3135 -0.3101 -0.3413 -0.0797 -0.1904 0.0311 -0.2725 -0.2014 0.4810 0.0526 -0.3998 -0.0053 0.0468 0.0832 0.0684 0.0561 0.0732 0.0643 0.0756 0.0269 0.0894 0.0807 0.0882 0.0899 0.0896 0.0806 0.0906 0.0919 0.0958 0.1034 0.0631 0.1320 0.1181 0.1090 0.1171 0.1141 0.1185 0.1387 0.1391 0.2824
va: 2.1121 1.9884 3.7450 3.8877 3.8563 3.8841 3.7679 3.9441 3.9428 3.9303 3.9823 3.8269 3.8891 3.6615 3.9225 3.7715 4.1172 3.8861 3.6812 3.6898 1.0212 1.0058 1.0095 1.0132 1.0170 1.0116 1.0107 1.0187 1.0088 1.0119 0.9995 1.0035 1.0044 1.0027 1.0062 1.0042 0.9990 1.0033 0.9909 0.9996 1.0209 1.0222 0.9921 0.9992 1.0325 1.0008 0.9896 0.9506
dispcorr: -0.024722167 hartree
energy: -853.255972841779
dipole: -24.94618 23.58620 -1.35998 14.56943 -14.50092 0.06851 -2.30389 2.78284 0.47895
magnitude: 1.44348 au
magnitude: 3.66903 debye
