program: Orca
programVersion: 5.0.2
elementType: O O C C C C C C C C C C C C C C C C C C H H H H H H H H H H H H H H H H H H H H H H H H H H H H
charge: 0
multiplicity: 1
keywords: wb97x-d3
keywords: def2-TZVPP
keywords: def2/J RIJCOSX
keywords: DEFGRID2
keywords: scfconv7
keywords: smallprint printgap noloewdin
keywords: NOSOSCF
formula: C18H28O2
InChI: InChI=1/C18H28O2/c1-6-13-20-18(19)14-17(5)12-8-11-16(4)10-7-9-15(2)3/h1,8,12,14-16H,7,9-11,13H2,2-5H3
48 atoms
O  5.078677 -1.793834 1.389115
O  4.060315 -3.476159 0.328686
C  -2.262859 1.099391 -0.461473
C  -3.055264 2.318784 -0.934387
C  -4.467894 2.424344 -0.370429
C  -5.2420 3.582366 -0.991822
C  -6.687416 3.752567 -0.512686
C  -0.920012 1.040853 -1.206837
C  -2.047788 1.10147 1.046706
C  -7.561845 2.557358 -0.877931
C  -6.771877 4.050929 0.980429
C  -0.15339 -0.207526 -0.941683
C  1.067788 -0.242719 -0.396568
C  1.85021 -1.451561 -0.157004
C  1.223048 -2.763528 -0.504508
C  3.081627 -1.279235 0.374305
C  4.068057 -2.31376 0.668894
C  6.139822 -2.671991 1.752335
C  6.992247 -2.995525 0.615781
C  7.719567 -3.250789 -0.304906
H  -2.834068 0.201327 -0.727625
H  -2.494269 3.227915 -0.687088
H  -3.116318 2.290104 -2.027843
H  -4.993319 1.480757 -0.549717
H  -4.427266 2.549959 0.714581
H  -5.248251 3.459597 -2.080406
H  -4.697237 4.513136 -0.798609
H  -7.087521 4.623792 -1.043216
H  -0.318251 1.917549 -0.948969
H  -1.121661 1.098711 -2.282253
H  -1.496158 1.991791 1.360093
H  -2.992079 1.089617 1.591423
H  -1.478937 0.230172 1.374824
H  -7.263122 1.655721 -0.339493
H  -7.511368 2.335641 -1.94598
H  -8.60827 2.747186 -0.631772
H  -6.138897 4.896807 1.256848
H  -7.794206 4.296866 1.273674
H  -6.461166 3.195115 1.583124
H  -0.650369 -1.132304 -1.221572
H  1.541532 0.695598 -0.121618
H  1.809276 -3.618577 -0.191739
H  1.068543 -2.834438 -1.583018
H  0.238195 -2.84076 -0.041906
H  3.390844 -0.269094 0.616444
H  5.759722 -3.583057 2.219139
H  6.716042 -2.134239 2.504569
H  8.366879 -3.471852 -1.123876
elementType: O C H
totalener: -853.23368332 hartree
nucrepener: 1398.06241499 hartree
electener: -2251.29609831 hartree
oneelecener: -3930.60465146 hartree
twoeener: 1679.30855315 hartree
cpcmener: -0.02679539 hartree
kineticenergy: 849.15665000 hartree
xcener: -85.610842043719 hartree
chargesum: 0.0000000
charge: -0.284644 -0.493558 0.119770 -0.190470 -0.142584 -0.153901 0.073970 -0.106927 -0.343785 -0.316813 -0.319497 -0.153303 -0.138924 0.013499 -0.262112 -0.184178 0.484949 0.035218 -0.428245 0.033023 0.044355 0.071427 0.071468 0.069724 0.075311 0.073956 0.074361 0.037189 0.080256 0.094963 0.085755 0.097969 0.097134 0.080661 0.092296 0.093691 0.092970 0.094769 0.079912 0.127670 0.115907 0.104718 0.112698 0.104816 0.120822 0.139925 0.138088 0.285701
qa: -0.2846 -0.4936 0.1198 -0.1905 -0.1426 -0.1539 0.0740 -0.1069 -0.3438 -0.3168 -0.3195 -0.1533 -0.1389 0.0135 -0.2621 -0.1842 0.4849 0.0352 -0.4282 0.0330 0.0444 0.0714 0.0715 0.0697 0.0753 0.0740 0.0744 0.0372 0.0803 0.0950 0.0858 0.0980 0.0971 0.0807 0.0923 0.0937 0.0930 0.0948 0.0799 0.1277 0.1159 0.1047 0.1127 0.1048 0.1208 0.1399 0.1381 0.2857
va: 2.1212 2.0043 3.7378 3.9128 3.8739 3.8886 3.8238 3.9191 3.9541 3.9408 3.9421 3.8899 3.9055 3.7290 3.9332 3.7859 4.1356 3.9016 3.7082 3.6400 1.0226 1.0100 1.0125 1.0048 0.9994 1.0101 1.0092 1.0110 1.0162 1.0058 1.0022 1.0016 1.0025 0.9981 1.0028 1.0040 1.0022 1.0046 0.9973 1.0038 1.0228 1.0288 0.9951 0.9958 1.0301 0.9993 0.9899 0.9459
dispcorr: -0.018482209 hartree
energy: -853.252165530197
dipole: -54.46329 53.38153 -1.08176 26.61423 -25.48255 1.13168 -3.29487 3.34752 0.05264
magnitude: 1.56642 au
magnitude: 3.98152 debye
