program: Orca
programVersion: 5.0.2
elementType: O O C C C C C C C C C C C C C C C C C C H H H H H H H H H H H H H H H H H H H H H H H H H H H H
charge: 0
multiplicity: 1
keywords: wb97x-d3
keywords: def2-TZVPP
keywords: def2/J RIJCOSX
keywords: DEFGRID2
keywords: scfconv7
keywords: smallprint printgap noloewdin
keywords: NOSOSCF
formula: C18H28O2
InChI: InChI=1/C18H28O2/c1-6-13-20-18(19)14-17(5)12-8-11-16(4)10-7-9-15(2)3/h1,8,12,14-16H,7,9-11,13H2,2-5H3
48 atoms
O  3.895204 -2.825244 1.031672
O  3.913269 -0.896381 -0.098122
C  -3.571267 0.109966 1.065007
C  -3.521699 1.45178 0.331062
C  -4.220684 1.459628 -1.022687
C  -4.310358 2.842035 -1.66339
C  -2.976228 3.533062 -1.95507
C  -2.963828 -1.05138 0.253348
C  -2.906846 0.221819 2.431434
C  -2.064886 2.678765 -2.828287
C  -3.224992 4.885922 -2.61239
C  -1.558779 -0.79685 -0.171468
C  -0.495107 -1.453296 0.305044
C  0.892268 -1.174123 -0.052812
C  1.147591 -0.099344 -1.06078
C  1.837918 -1.91126 0.571783
C  3.285546 -1.783564 0.437666
C  5.319012 -2.847419 1.015362
C  5.893332 -1.876449 1.93715
C  6.380814 -1.103125 2.715642
H  -4.625327 -0.145035 1.22267
H  -3.987034 2.208285 0.972643
H  -2.477507 1.763757 0.219303
H  -3.723409 0.769609 -1.710323
H  -5.236529 1.070377 -0.8979
H  -4.908321 3.494371 -1.017571
H  -4.867145 2.75678 -2.603652
H  -2.461557 3.714931 -1.00506
H  -3.575535 -1.224137 -0.637044
H  -3.015316 -1.964917 0.851079
H  -2.957345 -0.720836 2.9796
H  -1.853437 0.497283 2.345524
H  -3.394122 0.984082 3.042003
H  -1.767535 1.75105 -2.335859
H  -1.148237 3.215219 -3.081261
H  -2.558439 2.410634 -3.766243
H  -3.860572 5.522165 -1.993286
H  -2.29161 5.424261 -2.787591
H  -3.721301 4.766363 -3.5788
H  -1.416857 -0.010313 -0.906587
H  -0.651281 -2.239514 1.038419
H  2.180151 -0.049087 -1.383337
H  0.874135 0.87449 -0.649844
H  0.52561 -0.253874 -1.942724
H  1.507233 -2.686473 1.253251
H  5.707211 -2.693184 0.006525
H  5.596037 -3.855021 1.323603
H  6.802332 -0.407509 3.406638
elementType: O C H
totalener: -853.23326634 hartree
nucrepener: 1476.60331135 hartree
electener: -2329.83657769 hartree
oneelecener: -4087.52085841 hartree
twoeener: 1757.68428072 hartree
cpcmener: -0.02706586 hartree
kineticenergy: 849.15577299 hartree
xcener: -85.613057461430 hartree
chargesum: -0.0000000
charge: -0.283829 -0.494056 0.113005 -0.198203 -0.126878 -0.195627 0.080900 -0.131856 -0.333396 -0.299634 -0.303055 -0.115640 -0.162788 0.031009 -0.267734 -0.186796 0.482007 0.032097 -0.425828 0.033276 0.045054 0.080960 0.070916 0.070470 0.082095 0.073362 0.076182 0.034911 0.101952 0.091596 0.095733 0.083277 0.096080 0.072707 0.093078 0.089571 0.088412 0.089841 0.081122 0.109672 0.115682 0.107236 0.115140 0.103837 0.120313 0.140219 0.137821 0.285785
qa: -0.2838 -0.4941 0.1130 -0.1982 -0.1269 -0.1956 0.0809 -0.1319 -0.3334 -0.2996 -0.3031 -0.1156 -0.1628 0.0310 -0.2677 -0.1868 0.4820 0.0321 -0.4258 0.0333 0.0451 0.0810 0.0709 0.0705 0.0821 0.0734 0.0762 0.0349 0.1020 0.0916 0.0957 0.0833 0.0961 0.0727 0.0931 0.0896 0.0884 0.0898 0.0811 0.1097 0.1157 0.1072 0.1151 0.1038 0.1203 0.1402 0.1378 0.2858
va: 2.1222 2.0041 3.7659 3.8668 3.8593 3.9162 3.7713 3.9060 3.9560 3.9388 3.9302 3.8583 3.9017 3.7109 3.9334 3.7973 4.1353 3.9012 3.7124 3.6393 1.0162 1.0131 0.9999 1.0006 1.0119 1.0090 1.0109 1.0156 1.0026 1.0124 1.0040 0.9989 1.0052 0.9992 1.0058 1.0039 1.0042 1.0046 1.0037 0.9841 1.0213 1.0285 0.9942 0.9950 1.0304 0.9993 0.9898 0.9459
dispcorr: -0.020786657 hartree
energy: -853.254052996200
dipole: -38.49534 37.03375 -1.46159 23.11794 -23.52385 -0.40590 -10.86107 10.94883 0.08775
magnitude: 1.51944 au
magnitude: 3.86212 debye
