program: Orca
programVersion: 5.0.2
elementType: O O C C C C C C C C C C C C C C C C C C H H H H H H H H H H H H H H H H H H H H H H H H H H H H
charge: 0
multiplicity: 1
keywords: wb97x-d3
keywords: def2-TZVPP
keywords: def2/J RIJCOSX
keywords: DEFGRID2
keywords: scfconv7
keywords: smallprint printgap noloewdin
keywords: NOSOSCF
formula: C18H28O2
InChI: InChI=1/C18H28O2/c1-6-13-20-18(19)14-17(5)12-8-11-16(4)10-7-9-15(2)3/h1,8,12,14-16H,7,9-11,13H2,2-5H3
48 atoms
O  3.843567 -2.207604 1.778886
O  4.033098 -0.748553 0.096288
C  -3.697335 -0.323652 0.578018
C  -3.695394 1.160004 0.208396
C  -4.176125 1.464767 -1.204552
C  -4.370683 2.954253 -1.475116
C  -3.129566 3.832612 -1.297766
C  -2.846336 -1.190352 -0.371855
C  -3.261835 -0.510944 2.025921
C  -1.967203 3.370834 -2.169458
C  -3.475342 5.28702 -1.595788
C  -1.434071 -0.727426 -0.491227
C  -0.397932 -1.339734 0.092168
C  0.995502 -0.911977 0.013195
C  1.309594 0.289484 -0.819215
C  1.887425 -1.643177 0.718396
C  3.332067 -1.450305 0.791484
C  5.254468 -2.171315 1.968399
C  5.969604 -2.87185 0.909367
C  6.5730 -3.481351 0.068653
H  -4.725889 -0.690142 0.485215
H  -4.33682 1.68885 0.92213
H  -2.689295 1.566581 0.359149
H  -3.482379 1.045037 -1.938747
H  -5.130271 0.955039 -1.374046
H  -5.161902 3.33166 -0.81802
H  -4.741715 3.082232 -2.498376
H  -2.809776 3.776697 -0.251261
H  -3.304002 -1.189404 -1.364987
H  -2.870964 -2.223123 -0.015229
H  -3.265603 -1.564131 2.313382
H  -2.254298 -0.125682 2.1964
H  -3.932263 0.017762 2.705721
H  -1.11161 4.041527 -2.069678
H  -2.25005 3.354348 -3.225261
H  -1.622291 2.369052 -1.905426
H  -4.290526 5.642662 -0.962323
H  -2.619526 5.943878 -1.429477
H  -3.788523 5.411324 -2.635537
H  -1.269492 0.170238 -1.080122
H  -0.587013 -2.235929 0.676925
H  0.667443 1.123484 -0.533141
H  1.103052 0.081824 -1.870835
H  2.33947 0.614135 -0.736427
H  1.507741 -2.469008 1.308711
H  5.431145 -2.668579 2.921664
H  5.616859 -1.145436 2.060616
H  7.099974 -4.008581 -0.694985
elementType: O C H
totalener: -853.23301439 hartree
nucrepener: 1474.08103381 hartree
electener: -2327.31404820 hartree
oneelecener: -4082.43686195 hartree
twoeener: 1755.12281375 hartree
cpcmener: -0.02705916 hartree
kineticenergy: 849.15402988 hartree
xcener: -85.612268082920 hartree
chargesum: -0.0000000
charge: -0.284165 -0.492742 0.113188 -0.196874 -0.124562 -0.196507 0.078012 -0.138076 -0.334508 -0.294265 -0.302489 -0.118503 -0.166896 0.025730 -0.262601 -0.186219 0.481965 0.033082 -0.423815 0.030129 0.044320 0.080940 0.070963 0.068362 0.081412 0.074026 0.076866 0.035540 0.102991 0.093262 0.095496 0.083070 0.096863 0.093469 0.088477 0.066665 0.088898 0.089664 0.081323 0.125478 0.116357 0.100201 0.115161 0.106311 0.120625 0.137936 0.140107 0.285334
qa: -0.2842 -0.4927 0.1132 -0.1969 -0.1246 -0.1965 0.0780 -0.1381 -0.3345 -0.2943 -0.3025 -0.1185 -0.1669 0.0257 -0.2626 -0.1862 0.4820 0.0331 -0.4238 0.0301 0.0443 0.0809 0.0710 0.0684 0.0814 0.0740 0.0769 0.0355 0.1030 0.0933 0.0955 0.0831 0.0969 0.0935 0.0885 0.0667 0.0889 0.0897 0.0813 0.1255 0.1164 0.1002 0.1152 0.1063 0.1206 0.1379 0.1401 0.2853
va: 2.1215 2.0065 3.7718 3.8667 3.8617 3.9179 3.7719 3.9125 3.9577 3.9372 3.9298 3.8514 3.8845 3.7160 3.9342 3.7909 4.1373 3.9007 3.7112 3.6470 1.0165 1.0122 0.9998 1.0015 1.0123 1.0088 1.0108 1.0154 1.0028 1.0127 1.0041 0.9987 1.0057 1.0058 1.0045 1.0036 1.0042 1.0046 1.0037 0.9819 1.0213 0.9949 0.9945 1.0297 1.0310 0.9903 0.9990 0.9462
dispcorr: -0.020744204 hartree
energy: -853.253758597590
dipole: -39.50372 37.98247 -1.52124 24.28301 -24.37910 -0.09609 -8.44569 8.83821 0.39253
magnitude: 1.57400 au
magnitude: 4.00080 debye
