program: Orca
programVersion: 5.0.2
elementType: O O C C C C C C C C C C C C C C C C C C H H H H H H H H H H H H H H H H H H H H H H H H H H H H
charge: 0
multiplicity: 1
keywords: wb97x-d3
keywords: def2-TZVPP
keywords: def2/J RIJCOSX
keywords: DEFGRID2
keywords: scfconv7
keywords: smallprint printgap noloewdin
keywords: NOSOSCF
formula: C18H28O2
InChI: InChI=1/C18H28O2/c1-6-13-20-18(19)14-17(5)12-8-11-16(4)10-7-9-15(2)3/h1,8,12,14-16H,7,9-11,13H2,2-5H3
48 atoms
O  3.854724 -2.231081 1.774151
O  4.056164 -0.784554 0.081333
C  -3.694033 -0.331246 0.556181
C  -3.716175 1.157347 0.208293
C  -4.197106 1.47657 -1.201396
C  -4.379651 2.969862 -1.459438
C  -3.125749 3.832052 -1.292954
C  -2.822558 -1.16964 -0.400124
C  -3.263706 -0.532767 2.003648
C  -1.988047 3.370381 -2.196972
C  -3.459504 5.295507 -1.558133
C  -1.410868 -0.697442 -0.493127
C  -0.380324 -1.320563 0.089105
C  1.015679 -0.899039 0.024185
C  1.336577 0.325387 -0.771292
C  1.902808 -1.653884 0.710133
C  3.34952 -1.474587 0.782471
C  5.265866 -2.201964 1.965304
C  5.974624 -2.933819 0.922993
C  6.563268 -3.552927 0.079135
H  -4.715173 -0.715069 0.451655
H  -4.370266 1.664292 0.926501
H  -2.717999 1.578762 0.370251
H  -3.508682 1.05728 -1.940675
H  -5.155607 0.975544 -1.37234
H  -5.158624 3.35146 -0.790193
H  -4.761666 3.108839 -2.477223
H  -2.784389 3.754672 -0.254718
H  -3.266904 -1.151434 -1.399085
H  -2.843982 -2.21005 -0.066254
H  -3.936631 -0.011697 2.68686
H  -3.267378 -1.588917 2.280114
H  -2.256972 -0.148605 2.181062
H  -1.123957 4.031825 -2.109928
H  -2.295843 3.368183 -3.245998
H  -1.646632 2.362644 -1.951967
H  -3.799074 5.442061 -2.586664
H  -4.251868 5.651281 -0.896351
H  -2.590204 5.937537 -1.404178
H  -1.241623 0.21099 -1.064096
H  -0.576542 -2.226643 0.656036
H  0.724761 1.162166 -0.430308
H  1.091935 0.167566 -1.823291
H  2.3767 0.620829 -0.708173
H  1.517848 -2.489863 1.282686
H  5.437596 -2.67644 2.931226
H  5.637293 -1.177272 2.032109
H  7.089046 -4.105199 -0.667562
elementType: O C H
totalener: -853.23300693 hartree
nucrepener: 1472.96190300 hartree
electener: -2326.19490993 hartree
oneelecener: -4080.19645751 hartree
twoeener: 1754.00154759 hartree
cpcmener: -0.02704538 hartree
kineticenergy: 849.14997779 hartree
xcener: -85.611329576686 hartree
chargesum: 0.0000000
charge: -0.283934 -0.492545 0.113925 -0.197894 -0.126511 -0.195037 0.076578 -0.138909 -0.334743 -0.297795 -0.302130 -0.115430 -0.167815 0.022996 -0.262003 -0.183288 0.479550 0.035603 -0.426258 0.032035 0.044245 0.080775 0.071723 0.069064 0.081590 0.074053 0.077384 0.035666 0.102887 0.093634 0.096539 0.095873 0.083350 0.093179 0.088528 0.071230 0.081398 0.088893 0.089452 0.123474 0.116020 0.102448 0.112686 0.105700 0.121462 0.137886 0.138938 0.285527
qa: -0.2839 -0.4925 0.1139 -0.1979 -0.1265 -0.1950 0.0766 -0.1389 -0.3347 -0.2978 -0.3021 -0.1154 -0.1678 0.0230 -0.2620 -0.1833 0.4796 0.0356 -0.4263 0.0320 0.0442 0.0808 0.0717 0.0691 0.0816 0.0741 0.0774 0.0357 0.1029 0.0936 0.0965 0.0959 0.0834 0.0932 0.0885 0.0712 0.0814 0.0889 0.0895 0.1235 0.1160 0.1024 0.1127 0.1057 0.1215 0.1379 0.1389 0.2855
va: 2.1221 2.0059 3.7721 3.8698 3.8646 3.9163 3.7722 3.9095 3.9574 3.9362 3.9297 3.8462 3.8876 3.7181 3.9342 3.7909 4.1368 3.9009 3.7098 3.6391 1.0166 1.0125 0.9997 1.0011 1.0122 1.0089 1.0110 1.0158 1.0026 1.0123 1.0058 1.0040 0.9987 1.0057 1.0045 1.0021 1.0036 1.0042 1.0046 0.9814 1.0212 0.9948 0.9950 1.0301 1.0306 0.9899 0.9997 0.9460
dispcorr: -0.020708737 hartree
energy: -853.253715663961
dipole: -39.59999 38.09164 -1.50834 24.50220 -24.57592 -0.07372 -8.38426 8.79459 0.41033
magnitude: 1.56490 au
magnitude: 3.97766 debye
