program: Orca
programVersion: 5.0.2
elementType: O O C C C C C C C C C C C C C C C C C C H H H H H H H H H H H H H H H H H H H H H H H H H H H H
charge: 0
multiplicity: 1
keywords: wb97x-d3
keywords: def2-TZVPP
keywords: def2/J RIJCOSX
keywords: DEFGRID2
keywords: scfconv7
keywords: smallprint printgap noloewdin
keywords: NOSOSCF
formula: C18H28O2
InChI: InChI=1/C18H28O2/c1-6-13-20-18(19)14-17(5)12-8-11-16(4)10-7-9-15(2)3/h1,8,12,14-16H,7,9-11,13H2,2-5H3
48 atoms
O  3.47329 -1.666182 1.295655
O  3.087588 -1.554947 -0.901447
C  -4.418924 -0.176113 0.101837
C  -3.719862 1.153867 0.407813
C  -2.610356 1.556886 -0.558181
C  -1.948811 2.873393 -0.168888
C  -0.736476 3.254535 -1.021199
C  -3.622964 -1.400001 0.590707
C  -5.805727 -0.202796 0.735859
C  -0.311824 4.688834 -0.728487
C  0.436673 2.303962 -0.801701
C  -2.309126 -1.586432 -0.081497
C  -1.128537 -1.635459 0.546499
C  0.164902 -1.726648 -0.120948
C  0.169474 -1.868489 -1.609522
C  1.263295 -1.644157 0.664716
C  2.654219 -1.623561 0.228152
C  4.873478 -1.622551 1.040145
C  5.313287 -0.307324 0.592269
C  5.705383 0.771252 0.239364
H  -4.54035 -0.263464 -0.984688
H  -4.471872 1.950338 0.41065
H  -3.323159 1.118615 1.429616
H  -1.856674 0.771094 -0.607365
H  -3.024251 1.643294 -1.568609
H  -1.636176 2.827201 0.881585
H  -2.694191 3.674384 -0.224865
H  -1.030745 3.197139 -2.076195
H  -4.23116 -2.290826 0.395644
H  -3.490646 -1.33896 1.675189
H  -6.324755 -1.140884 0.530809
H  -5.743037 -0.091198 1.821041
H  -6.427818 0.609656 0.357399
H  0.541619 4.987554 -1.340229
H  -0.021537 4.805465 0.318879
H  -1.121606 5.393947 -0.925522
H  0.747367 2.306726 0.246512
H  0.19743 1.273474 -1.070079
H  1.300743 2.598997 -1.400122
H  -2.348377 -1.667779 -1.163961
H  -1.106423 -1.539973 1.628293
H  -0.170147 -0.939368 -2.073435
H  -0.527341 -2.647743 -1.918588
H  1.14352 -2.109405 -2.016397
H  1.115492 -1.565337 1.73539
H  5.168706 -2.387132 0.31823
H  5.348724 -1.867572 1.989657
H  6.051587 1.731476 -0.072133
elementType: O C H
totalener: -853.23204195 hartree
nucrepener: 1524.86051066 hartree
electener: -2378.09255262 hartree
oneelecener: -4184.47945964 hartree
twoeener: 1806.38690702 hartree
cpcmener: -0.02735189 hartree
kineticenergy: 849.16008795 hartree
xcener: -85.612017553526 hartree
chargesum: 0.0000000
charge: -0.285876 -0.497337 0.088240 -0.191227 -0.060565 -0.169304 0.084068 -0.122557 -0.307611 -0.296752 -0.285687 -0.108102 -0.157435 0.000717 -0.266326 -0.193392 0.501222 0.032931 -0.428368 0.032814 0.041035 0.075756 0.068662 0.008672 0.066941 0.064040 0.072195 0.024281 0.094578 0.080857 0.090079 0.086611 0.089757 0.089517 0.080798 0.087046 0.083509 0.063100 0.094262 0.134344 0.114829 0.115841 0.112240 0.109162 0.118363 0.140078 0.138348 0.285647
qa: -0.2859 -0.4973 0.0882 -0.1912 -0.0606 -0.1693 0.0841 -0.1226 -0.3076 -0.2968 -0.2857 -0.1081 -0.1574 0.0007 -0.2663 -0.1934 0.5012 0.0329 -0.4284 0.0328 0.0410 0.0758 0.0687 0.0087 0.0669 0.0640 0.0722 0.0243 0.0946 0.0809 0.0901 0.0866 0.0898 0.0895 0.0808 0.0870 0.0835 0.0631 0.0943 0.1343 0.1148 0.1158 0.1122 0.1092 0.1184 0.1401 0.1383 0.2856
va: 2.1223 1.9971 3.7573 3.9243 3.8363 3.9065 3.8221 3.9261 3.9342 3.9273 3.9348 3.8742 3.8879 3.7007 3.9186 3.7739 4.1222 3.9043 3.7040 3.6418 1.0225 1.0067 1.0086 1.0456 1.0172 1.0114 1.0111 1.0176 1.0055 1.0141 1.0045 1.0002 1.0045 1.0051 1.0028 1.0052 1.0045 1.0050 1.0068 1.0006 1.0223 0.9886 0.9973 1.0284 1.0317 0.9988 0.9897 0.9462
dispcorr: -0.021459327 hartree
energy: -853.253501282141
dipole: -30.34972 28.92898 -1.42075 17.68193 -17.83755 -0.15563 -3.77847 4.26766 0.48919
magnitude: 1.51064 au
magnitude: 3.83975 debye
