program: Orca
programVersion: 5.0.2
elementType: O O C C C C C C C C C C C C C C C C C C H H H H H H H H H H H H H H H H H H H H H H H H H H H H
charge: 0
multiplicity: 1
keywords: wb97x-d3
keywords: def2-TZVPP
keywords: def2/J RIJCOSX
keywords: DEFGRID2
keywords: scfconv7
keywords: smallprint printgap noloewdin
keywords: NOSOSCF
formula: C18H28O2
InChI: InChI=1/C18H28O2/c1-6-13-20-18(19)14-17(5)12-8-11-16(4)10-7-9-15(2)3/h1,8,12,14-16H,7,9-11,13H2,2-5H3
48 atoms
O  4.297842 -1.418526 -0.272706
O  3.58661 -2.302547 1.652826
C  -3.610585 -0.207734 -0.55078
C  -2.774496 1.058076 -0.73571
C  -3.568066 2.356541 -0.648545
C  -2.709706 3.578598 -0.951853
C  -3.45626 4.913546 -0.946933
C  -2.786121 -1.465897 -0.880466
C  -4.241036 -0.292287 0.835203
C  -4.040676 5.241924 0.422634
C  -2.533427 6.03561 -1.408654
C  -1.625915 -1.68179 0.0304
C  -0.348067 -1.611579 -0.359306
C  0.811063 -1.813144 0.504903
C  0.556894 -2.126864 1.944111
C  2.026109 -1.681533 -0.073252
C  3.331022 -1.847529 0.559293
C  5.644032 -1.53192 0.178479
C  6.110123 -2.912352 0.173566
C  6.50792 -4.045286 0.150424
H  -4.422488 -0.180563 -1.286491
H  -1.97068 1.077892 0.008953
H  -2.279098 1.011305 -1.712205
H  -4.406229 2.318033 -1.35384
H  -4.010458 2.451413 0.346267
H  -2.241585 3.442536 -1.933004
H  -1.885261 3.631972 -0.230121
H  -4.284202 4.838758 -1.662269
H  -2.437277 -1.404758 -1.91457
H  -3.448543 -2.335739 -0.81785
H  -4.76479 -1.240401 0.972973
H  -3.493364 -0.20991 1.627193
H  -4.969858 0.502984 0.993596
H  -3.254727 5.279462 1.181664
H  -4.77696 4.506036 0.747876
H  -4.537345 6.213994 0.415943
H  -3.055346 6.993558 -1.446827
H  -1.686327 6.150044 -0.727504
H  -2.130388 5.840141 -2.404226
H  -1.861395 -1.902477 1.066992
H  -0.13438 -1.390043 -1.401359
H  1.459627 -2.189501 2.538556
H  0.024266 -3.075336 2.034666
H  -0.08726 -1.363953 2.383708
H  2.059338 -1.413752 -1.122896
H  5.769627 -1.090779 1.16942
H  6.234849 -0.940908 -0.520645
H  6.858858 -5.052805 0.125362
elementType: O C H
totalener: -853.23378851 hartree
nucrepener: 1434.25671209 hartree
electener: -2287.49050059 hartree
oneelecener: -4003.03203656 hartree
twoeener: 1715.54153597 hartree
cpcmener: -0.02671405 hartree
kineticenergy: 849.15430533 hartree
xcener: -85.610219124208 hartree
chargesum: -0.0000000
charge: -0.283988 -0.494190 0.127442 -0.193256 -0.122637 -0.160074 0.078769 -0.134795 -0.340205 -0.307890 -0.300478 -0.131054 -0.156457 0.021964 -0.262324 -0.184372 0.484676 0.035071 -0.426841 0.031569 0.042461 0.068295 0.073402 0.061251 0.072219 0.068825 0.065453 0.026197 0.086516 0.100101 0.098877 0.084802 0.095887 0.082979 0.089072 0.091439 0.089987 0.080569 0.088182 0.131520 0.115318 0.105399 0.111660 0.105298 0.120161 0.139528 0.137924 0.285748
qa: -0.2840 -0.4942 0.1274 -0.1933 -0.1226 -0.1601 0.0788 -0.1348 -0.3402 -0.3079 -0.3005 -0.1311 -0.1565 0.0220 -0.2623 -0.1844 0.4847 0.0351 -0.4268 0.0316 0.0425 0.0683 0.0734 0.0613 0.0722 0.0688 0.0655 0.0262 0.0865 0.1001 0.0989 0.0848 0.0959 0.0830 0.0891 0.0914 0.0900 0.0806 0.0882 0.1315 0.1153 0.1054 0.1117 0.1053 0.1202 0.1395 0.1379 0.2857
va: 2.1217 2.0045 3.7370 3.9353 3.8871 3.8875 3.8105 3.9187 3.9610 3.9294 3.9317 3.8575 3.9033 3.7179 3.9285 3.7827 4.1369 3.9010 3.7080 3.6408 1.0184 1.0064 1.0123 1.0111 1.0028 1.0124 1.0109 1.0183 1.0135 1.0051 1.0029 0.9960 1.0008 1.0024 1.0025 1.0043 1.0048 1.0030 1.0048 0.9930 1.0225 1.0306 0.9955 0.9956 1.0308 0.9992 0.9898 0.9459
dispcorr: -0.018758364 hartree
energy: -853.252546872112
dipole: -41.05406 39.74284 -1.31122 29.02372 -28.44946 0.57426 -2.53313 1.78384 -0.74929
magnitude: 1.61570 au
magnitude: 4.10679 debye
