program: Orca
programVersion: 5.0.2
elementType: O O C C C C C C C C C C C C C C C C C C H H H H H H H H H H H H H H H H H H H H H H H H H H H H
charge: 0
multiplicity: 1
keywords: wb97x-d3
keywords: def2-TZVPP
keywords: def2/J RIJCOSX
keywords: DEFGRID2
keywords: scfconv7
keywords: smallprint printgap noloewdin
keywords: NOSOSCF
formula: C18H28O2
InChI: InChI=1/C18H28O2/c1-6-13-20-18(19)14-17(5)12-8-11-16(4)10-7-9-15(2)3/h1,8,12,14-16H,7,9-11,13H2,2-5H3
48 atoms
O  4.078375 -3.20966 1.606877
O  4.143346 -2.120008 -0.342505
C  -3.041049 0.386709 0.694193
C  -3.11069 1.156208 -0.626252
C  -3.797654 2.514182 -0.526723
C  -3.891907 3.212822 -1.878551
C  -4.689682 4.517886 -1.882099
C  -2.622751 -1.080789 0.477643
C  -2.134869 1.066038 1.714566
C  -4.076008 5.573491 -0.96873
C  -4.812718 5.055757 -3.3036
C  -1.259673 -1.234406 -0.105779
C  -0.214028 -1.738244 0.559554
C  1.141443 -1.858435 0.031435
C  1.374502 -1.436073 -1.383672
C  2.078997 -2.346403 0.874676
C  3.503091 -2.520039 0.605006
C  5.479776 -3.446661 1.514205
C  6.255224 -2.237592 1.759072
C  6.902467 -1.250136 1.97517
H  -4.053801 0.351711 1.111749
H  -2.099519 1.294709 -1.025547
H  -3.645608 0.546632 -1.362986
H  -4.804947 2.379549 -0.116365
H  -3.261648 3.149823 0.182715
H  -4.348542 2.524069 -2.597976
H  -2.881165 3.413831 -2.254112
H  -5.69901 4.295867 -1.515194
H  -3.349715 -1.548606 -0.194058
H  -2.678613 -1.612259 1.430789
H  -1.123184 1.19901 1.32547
H  -2.50948 2.050981 1.9942
H  -2.059295 0.47695 2.630539
H  -3.044052 5.787497 -1.259048
H  -4.06694 5.263658 0.076883
H  -4.632333 6.511161 -1.022147
H  -3.830263 5.300637 -3.715363
H  -5.275108 4.325181 -3.970238
H  -5.4182 5.963295 -3.338401
H  -1.132774 -0.893882 -1.128624
H  -0.35939 -2.071961 1.583412
H  2.372189 -1.657366 -1.740918
H  1.207067 -0.362539 -1.488972
H  0.660505 -1.930149 -2.043618
H  1.761121 -2.645723 1.866617
H  5.746726 -3.881185 0.548638
H  5.700152 -4.189615 2.279886
H  7.478584 -0.373687 2.171335
elementType: O C H
totalener: -853.23375713 hartree
nucrepener: 1421.81391074 hartree
electener: -2275.04766787 hartree
oneelecener: -3978.14579700 hartree
twoeener: 1703.09812913 hartree
cpcmener: -0.02662269 hartree
kineticenergy: 849.15560288 hartree
xcener: -85.610301946201 hartree
chargesum: -0.0000000
charge: -0.284268 -0.493939 0.140496 -0.201932 -0.121001 -0.159209 0.076368 -0.141301 -0.345317 -0.306762 -0.300811 -0.130146 -0.158880 0.024140 -0.263367 -0.184866 0.485180 0.033844 -0.427327 0.033271 0.042323 0.069305 0.077415 0.061483 0.071281 0.068241 0.066124 0.026941 0.095538 0.089018 0.085323 0.098604 0.097550 0.083055 0.088880 0.091341 0.080835 0.088018 0.090373 0.131087 0.115538 0.106535 0.111657 0.105541 0.120182 0.139846 0.138209 0.285580
qa: -0.2843 -0.4939 0.1405 -0.2019 -0.1210 -0.1592 0.0764 -0.1413 -0.3453 -0.3068 -0.3008 -0.1301 -0.1589 0.0241 -0.2634 -0.1849 0.4852 0.0338 -0.4273 0.0333 0.0423 0.0693 0.0774 0.0615 0.0713 0.0682 0.0661 0.0269 0.0955 0.0890 0.0853 0.0986 0.0976 0.0831 0.0889 0.0913 0.0808 0.0880 0.0904 0.1311 0.1155 0.1065 0.1117 0.1055 0.1202 0.1398 0.1382 0.2856
va: 2.1219 2.0041 3.7299 3.9475 3.8804 3.8824 3.8129 3.9389 3.9625 3.9302 3.9329 3.8554 3.8928 3.7145 3.9290 3.7855 4.1361 3.9012 3.7065 3.6385 1.0173 1.0046 1.0098 1.0113 1.0045 1.0127 1.0110 1.0182 1.0066 1.0123 0.9969 1.0034 1.0037 1.0021 1.0019 1.0047 1.0029 1.0047 1.0048 0.9969 1.0228 1.0292 0.9956 0.9959 1.0305 0.9991 0.9897 0.9460
dispcorr: -0.018722024 hartree
energy: -853.252479157204
dipole: -42.68536 41.15840 -1.52696 31.43814 -31.55356 -0.11542 -11.11516 11.48694 0.37178
magnitude: 1.57580 au
magnitude: 4.00537 debye
