program: Orca
programVersion: 5.0.2
elementType: O O C C C C C C C C C C C C C C C C C C H H H H H H H H H H H H H H H H H H H H H H H H H H H H
charge: 0
multiplicity: 1
keywords: wb97x-d3
keywords: def2-TZVPP
keywords: def2/J RIJCOSX
keywords: DEFGRID2
keywords: scfconv7
keywords: smallprint printgap noloewdin
keywords: NOSOSCF
formula: C18H28O2
InChI: InChI=1/C18H28O2/c1-6-13-20-18(19)14-17(5)12-8-11-16(4)10-7-9-15(2)3/h1,8,12,14-16H,7,9-11,13H2,2-5H3
48 atoms
O  4.177078 -0.826191 0.876484
O  3.668554 -2.462358 -0.558813
C  -3.804617 -0.22725 0.070774
C  -3.066446 1.051615 -0.324672
C  -3.800402 1.915045 -1.344227
C  -2.95735 3.068322 -1.88297
C  -2.457939 4.071481 -0.840315
C  -2.929719 -1.107336 0.978462
C  -5.125064 0.069331 0.771476
C  -1.616473 5.149779 -1.51319
C  -3.605203 4.698783 -0.058214
C  -1.68557 -1.583677 0.312328
C  -0.448852 -1.279423 0.721178
C  0.787487 -1.731622 0.090038
C  0.672185 -2.619444 -1.107061
C  1.941001 -1.292442 0.64192
C  3.301827 -1.616636 0.22725
C  5.562424 -1.043331 0.627123
C  6.045073 -2.266543 1.255239
C  6.460404 -3.258717 1.789464
H  -4.019278 -0.795238 -0.843101
H  -2.861768 1.629485 0.584024
H  -2.087853 0.78855 -0.739998
H  -4.102144 1.285804 -2.18805
H  -4.729137 2.303893 -0.918348
H  -3.540691 3.612504 -2.634542
H  -2.092866 2.654823 -2.413863
H  -1.812387 3.543029 -0.129978
H  -3.517912 -1.981129 1.279787
H  -2.684172 -0.558935 1.893001
H  -5.63413 -0.851468 1.062025
H  -4.96067 0.656665 1.678406
H  -5.810012 0.630267 0.135104
H  -1.212544 5.855137 -0.784457
H  -2.210249 5.721897 -2.230664
H  -0.772584 4.718756 -2.055685
H  -4.307473 5.201349 -0.728704
H  -4.168356 3.959481 0.513562
H  -3.238192 5.443029 0.651164
H  -1.830553 -2.207786 -0.565144
H  -0.333342 -0.648019 1.597768
H  0.210832 -3.568859 -0.828906
H  1.622566 -2.832491 -1.58004
H  0.019074 -2.161161 -1.85064
H  1.869694 -0.620493 1.489256
H  6.073003 -0.18216 1.056986
H  5.777903 -1.052719 -0.443271
H  6.820861 -4.14402 2.264134
elementType: O C H
totalener: -853.23397625 hartree
nucrepener: 1453.38563116 hartree
electener: -2306.61960741 hartree
oneelecener: -4041.23019776 hartree
twoeener: 1734.61059035 hartree
cpcmener: -0.02665733 hartree
kineticenergy: 849.15429184 hartree
xcener: -85.610703893446 hartree
chargesum: -0.0000000
charge: -0.284714 -0.494009 0.100700 -0.196079 -0.129926 -0.194004 0.074938 -0.118536 -0.324243 -0.299434 -0.306416 -0.123025 -0.161347 0.024392 -0.262673 -0.187508 0.486718 0.035875 -0.427655 0.032246 0.042014 0.069689 0.083534 0.079037 0.071946 0.077512 0.073865 0.034154 0.096924 0.081786 0.093876 0.084687 0.093883 0.089576 0.080517 0.088253 0.085674 0.086445 0.091762 0.126852 0.115941 0.113405 0.105026 0.104637 0.120576 0.137669 0.139596 0.285861
qa: -0.2847 -0.4940 0.1007 -0.1961 -0.1299 -0.1940 0.0749 -0.1185 -0.3242 -0.2994 -0.3064 -0.1230 -0.1613 0.0244 -0.2627 -0.1875 0.4867 0.0359 -0.4277 0.0322 0.0420 0.0697 0.0835 0.0790 0.0719 0.0775 0.0739 0.0342 0.0969 0.0818 0.0939 0.0847 0.0939 0.0896 0.0805 0.0883 0.0857 0.0864 0.0918 0.1269 0.1159 0.1134 0.1050 0.1046 0.1206 0.1377 0.1396 0.2859
va: 2.1209 2.0046 3.7592 3.8850 3.8755 3.9102 3.7808 3.9103 3.9467 3.9280 3.9342 3.8742 3.9029 3.7170 3.9307 3.7821 4.1376 3.9003 3.7107 3.6403 1.0230 1.0097 1.0076 1.0113 1.0021 1.0107 1.0090 1.0156 1.0062 1.0150 1.0046 1.0016 1.0018 1.0047 1.0040 1.0045 1.0024 1.0006 1.0052 1.0037 1.0226 0.9953 1.0296 0.9959 1.0306 0.9899 0.9994 0.9458
dispcorr: -0.019215947 hartree
energy: -853.253192195839
dipole: -40.80502 39.50927 -1.29575 24.91015 -24.25942 0.65072 -6.62128 6.92614 0.30486
magnitude: 1.48167 au
magnitude: 3.76610 debye
