program: Orca
programVersion: 5.0.2
elementType: O O C C C C C C C C C C C C C C C C C C H H H H H H H H H H H H H H H H H H H H H H H H H H H H
charge: 0
multiplicity: 1
keywords: wb97x-d3
keywords: def2-TZVPP
keywords: def2/J RIJCOSX
keywords: DEFGRID2
keywords: scfconv7
keywords: smallprint printgap noloewdin
keywords: NOSOSCF
formula: C18H28O2
InChI: InChI=1/C18H28O2/c1-6-13-20-18(19)14-17(5)12-8-11-16(4)10-7-9-15(2)3/h1,8,12,14-16H,7,9-11,13H2,2-5H3
48 atoms
O  4.236987 -0.90769 0.922742
O  3.71511 -2.504791 -0.551027
C  -3.784458 -0.217722 0.080382
C  -3.087332 1.082914 -0.318927
C  -3.849489 1.916215 -1.343533
C  -3.046106 3.094239 -1.889377
C  -2.594286 4.129008 -0.856253
C  -2.871464 -1.084956 0.961086
C  -5.096395 0.040629 0.811824
C  -1.776912 5.222698 -1.534676
C  -3.772362 4.732724 -0.101326
C  -1.631393 -1.535855 0.269358
C  -0.393074 -1.249046 0.685679
C  0.841832 -1.703052 0.053735
C  0.726449 -2.532824 -1.184206
C  1.995748 -1.314622 0.64125
C  3.355603 -1.662416 0.241673
C  5.621086 -1.143433 0.68443
C  6.080955 -2.374017 1.315355
C  6.476345 -3.37369 1.85073
H  -4.004614 -0.782446 -0.834193
H  -2.903329 1.671127 0.587509
H  -2.100079 0.850299 -0.732439
H  -4.128132 1.272007 -2.183884
H  -4.791708 2.274609 -0.920532
H  -3.642172 3.605948 -2.653586
H  -2.161673 2.7063 -2.406584
H  -1.943561 3.632882 -0.127545
H  -3.435467 -1.97277 1.268258
H  -2.617625 -0.539668 1.875234
H  -5.805726 0.597118 0.198773
H  -5.580285 -0.894716 1.098877
H  -4.924701 0.617311 1.724198
H  -2.376908 5.761905 -2.272116
H  -0.910195 4.810114 -2.054991
H  -1.408749 5.953548 -0.812239
H  -4.478003 5.205442 -0.78974
H  -4.322525 3.984864 0.471929
H  -3.438802 5.497142 0.603052
H  -1.780606 -2.136368 -0.623871
H  -0.27476 -0.643288 1.579783
H  1.681677 -2.769466 -1.635976
H  0.120215 -2.011353 -1.926279
H  0.212825 -3.470467 -0.96429
H  1.926698 -0.672584 1.511617
H  6.140436 -0.289905 1.118984
H  5.844931 -1.155016 -0.384205
H  6.828837 -4.264568 2.321043
elementType: O C H
totalener: -853.23399205 hartree
nucrepener: 1448.72741611 hartree
electener: -2301.96140816 hartree
oneelecener: -4031.90397285 hartree
twoeener: 1729.94256470 hartree
cpcmener: -0.02663047 hartree
kineticenergy: 849.15463056 hartree
xcener: -85.610381240287 hartree
chargesum: -0.0000000
charge: -0.284077 -0.494069 0.097489 -0.191231 -0.132114 -0.192766 0.073634 -0.116347 -0.322852 -0.299635 -0.305974 -0.128408 -0.156006 0.020344 -0.260287 -0.184801 0.485062 0.035793 -0.428104 0.033455 0.041189 0.069242 0.082864 0.078688 0.072225 0.077848 0.073748 0.034850 0.097216 0.081741 0.093678 0.093737 0.084363 0.080655 0.088280 0.089435 0.085227 0.086780 0.091627 0.127368 0.115434 0.104522 0.105576 0.111187 0.120646 0.137809 0.139176 0.285783
qa: -0.2841 -0.4941 0.0975 -0.1912 -0.1321 -0.1928 0.0736 -0.1163 -0.3229 -0.2996 -0.3060 -0.1284 -0.1560 0.0203 -0.2603 -0.1848 0.4851 0.0358 -0.4281 0.0335 0.0412 0.0692 0.0829 0.0787 0.0722 0.0778 0.0737 0.0349 0.0972 0.0817 0.0937 0.0937 0.0844 0.0807 0.0883 0.0894 0.0852 0.0868 0.0916 0.1274 0.1154 0.1045 0.1056 0.1112 0.1206 0.1378 0.1392 0.2858
va: 2.1217 2.0044 3.7663 3.8834 3.8756 3.9093 3.7816 3.9078 3.9457 3.9280 3.9338 3.8772 3.9005 3.7203 3.9304 3.7809 4.1385 3.9003 3.7128 3.6370 1.0230 1.0100 1.0079 1.0115 1.0023 1.0107 1.0090 1.0156 1.0055 1.0150 1.0022 1.0045 1.0017 1.0039 1.0046 1.0047 1.0025 1.0006 1.0052 1.0038 1.0228 1.0298 0.9957 0.9956 1.0307 0.9898 1.0000 0.9458
dispcorr: -0.019121808 hartree
energy: -853.253113859190
dipole: -41.50099 40.23144 -1.26955 25.43273 -24.76084 0.67189 -6.84486 7.14309 0.29823
magnitude: 1.46702 au
magnitude: 3.72886 debye
