program: Orca
programVersion: 5.0.2
elementType: O O C C C C C C C C C C C C C C C C C C H H H H H H H H H H H H H H H H H H H H H H H H H H H H
charge: 0
multiplicity: 1
keywords: wb97x-d3
keywords: def2-TZVPP
keywords: def2/J RIJCOSX
keywords: DEFGRID2
keywords: scfconv7
keywords: smallprint printgap noloewdin
keywords: NOSOSCF
formula: C18H28O2
InChI: InChI=1/C18H28O2/c1-6-13-20-18(19)14-17(5)12-8-11-16(4)10-7-9-15(2)3/h1,8,12,14-16H,7,9-11,13H2,2-5H3
48 atoms
O  3.951441 -0.76296 0.035835
O  3.224614 -2.506083 1.230835
C  -4.116411 -0.26624 -0.46341
C  -3.562496 0.910417 0.339093
C  -2.906103 2.002868 -0.495979
C  -2.450961 3.182573 0.354473
C  -1.733281 4.293663 -0.412671
C  -3.029659 -0.99285 -1.276351
C  -4.875274 -1.227804 0.444393
C  -2.644149 4.965023 -1.43448
C  -1.171672 5.328595 0.555809
C  -1.917188 -1.530325 -0.442517
C  -0.637771 -1.164852 -0.581606
C  0.48078 -1.686573 0.197594
C  0.178258 -2.684621 1.268333
C  1.706319 -1.210416 -0.116826
C  2.985705 -1.591955 0.472492
C  5.275683 -0.998792 0.503314
C  5.87931 -2.165794 -0.126736
C  6.400538 -3.107562 -0.659232
H  -4.829282 0.13205 -1.194316
H  -4.385085 1.352685 0.911585
H  -2.847773 0.539128 1.082911
H  -2.041269 1.600995 -1.033781
H  -3.61344 2.335506 -1.262015
H  -1.782307 2.808117 1.137544
H  -3.314701 3.612728 0.875891
H  -0.891505 3.841914 -0.951466
H  -2.627632 -0.329799 -2.045386
H  -3.5052 -1.826646 -1.804513
H  -5.714809 -0.724724 0.927132
H  -5.276888 -2.073672 -0.116756
H  -4.240569 -1.628414 1.237466
H  -3.51725 5.405869 -0.946031
H  -3.006914 4.266815 -2.189656
H  -2.123248 5.767119 -1.960813
H  -1.972344 5.808396 1.124324
H  -0.485329 4.874556 1.27303
H  -0.625741 6.11441 0.030349
H  -2.188049 -2.262875 0.311716
H  -0.386515 -0.432517 -1.344011
H  -0.586401 -2.29197 1.940015
H  1.042503 -2.954555 1.862114
H  -0.230201 -3.59691 0.829544
H  1.769958 -0.45883 -0.895023
H  5.302152 -1.094892 1.590748
H  5.83995 -0.104869 0.238917
H  6.858165 -3.948886 -1.130078
elementType: O C H
totalener: -853.23424604 hartree
nucrepener: 1467.13725483 hartree
electener: -2320.37150087 hartree
oneelecener: -4068.71783631 hartree
twoeener: 1748.34633543 hartree
cpcmener: -0.02676669 hartree
kineticenergy: 849.15895755 hartree
xcener: -85.611710287643 hartree
chargesum: -0.0000000
charge: -0.283957 -0.493623 0.095296 -0.184989 -0.132562 -0.157958 0.074507 -0.137593 -0.315770 -0.304840 -0.299138 -0.132423 -0.154122 0.015698 -0.262135 -0.182882 0.482588 0.034301 -0.427042 0.032856 0.042106 0.081148 0.071963 0.060432 0.073453 0.069820 0.066730 0.026786 0.092691 0.102236 0.092488 0.095204 0.080329 0.081244 0.090311 0.090919 0.080464 0.088914 0.090097 0.134069 0.116059 0.105465 0.105695 0.111949 0.120188 0.139608 0.138090 0.285328
qa: -0.2840 -0.4936 0.0953 -0.1850 -0.1326 -0.1580 0.0745 -0.1376 -0.3158 -0.3048 -0.2991 -0.1324 -0.1541 0.0157 -0.2621 -0.1829 0.4826 0.0343 -0.4270 0.0329 0.0421 0.0811 0.0720 0.0604 0.0735 0.0698 0.0667 0.0268 0.0927 0.1022 0.0925 0.0952 0.0803 0.0812 0.0903 0.0909 0.0805 0.0889 0.0901 0.1341 0.1161 0.1055 0.1057 0.1119 0.1202 0.1396 0.1381 0.2853
va: 2.1213 2.0060 3.7791 3.9068 3.8673 3.8813 3.8164 3.9014 3.9508 3.9276 3.9291 3.8446 3.9007 3.7282 3.9280 3.7802 4.1419 3.9020 3.7100 3.6397 1.0177 1.0099 1.0063 1.0102 1.0122 1.0119 1.0122 1.0180 1.0053 1.0043 1.0047 1.0041 0.9999 1.0030 1.0027 1.0043 1.0032 1.0046 1.0049 0.9905 1.0216 0.9960 1.0301 0.9950 1.0311 0.9997 0.9897 0.9461
dispcorr: -0.019350381 hartree
energy: -853.253596425353
dipole: -36.97095 35.74241 -1.22854 23.40899 -22.68466 0.72432 -1.03139 0.50338 -0.52801
magnitude: 1.52078 au
magnitude: 3.86551 debye
