program: Orca
programVersion: 5.0.2
elementType: O O C C C C C C C C C C C C C C C C C C H H H H H H H H H H H H H H H H H H H H H H H H H H H H
charge: 0
multiplicity: 1
keywords: wb97x-d3
keywords: def2-TZVPP
keywords: def2/J RIJCOSX
keywords: DEFGRID2
keywords: scfconv7
keywords: smallprint printgap noloewdin
keywords: NOSOSCF
formula: C18H28O2
InChI: InChI=1/C18H28O2/c1-6-13-20-18(19)14-17(5)12-8-11-16(4)10-7-9-15(2)3/h1,8,12,14-16H,7,9-11,13H2,2-5H3
48 atoms
O  3.301114 -1.566796 -0.944983
O  2.98354 -0.999463 1.194648
C  -3.90362 -0.116013 -1.017805
C  -4.024617 1.219013 -0.277313
C  -2.826265 1.693773 0.543975
C  -1.561151 1.9362 -0.270293
C  -0.338321 2.326701 0.562459
C  -3.739757 -1.32856 -0.081086
C  -5.13589 -0.32426 -1.892428
C  0.91883 2.332684 -0.300138
C  -0.517323 3.676363 1.249527
C  -2.419892 -1.407996 0.624488
C  -1.258844 -1.582431 -0.016223
C  0.056859 -1.520278 0.605846
C  0.121557 -1.431471 2.096786
C  1.118963 -1.517921 -0.231629
C  2.519642 -1.335513 0.126688
C  4.703284 -1.382035 -0.78127
C  5.056244 0.028351 -0.680054
C  5.356433 1.189377 -0.613554
H  -3.030636 -0.08236 -1.678245
H  -4.256636 1.992347 -1.017807
H  -4.90055 1.164638 0.378874
H  -3.120057 2.620538 1.044925
H  -2.610847 0.984825 1.34918
H  -1.752122 2.716923 -1.016869
H  -1.315435 1.032888 -0.835389
H  -0.207591 1.564368 1.340863
H  -3.869661 -2.234496 -0.681224
H  -4.552005 -1.324682 0.649783
H  -5.268115 0.502331 -2.592433
H  -5.059692 -1.242948 -2.476515
H  -6.043175 -0.391994 -1.287291
H  1.08968 1.360397 -0.766958
H  1.806455 2.574991 0.287818
H  0.842042 3.073995 -1.099693
H  -1.361475 3.681177 1.940273
H  0.370605 3.948636 1.823204
H  -0.688249 4.467196 0.514336
H  -2.424859 -1.285667 1.702043
H  -1.269185 -1.696582 -1.097028
H  1.121299 -1.561994 2.492291
H  -0.521804 -2.189009 2.544899
H  -0.251911 -0.46213 2.434367
H  0.927513 -1.629575 -1.292494
H  5.159029 -1.81601 -1.670731
H  5.07904 -1.933217 0.083255
H  5.627219 2.219358 -0.546339
elementType: O C H
totalener: -853.22907111 hartree
nucrepener: 1576.97878878 hartree
electener: -2430.20785989 hartree
oneelecener: -4288.73876595 hartree
twoeener: 1858.53090606 hartree
cpcmener: -0.02734575 hartree
kineticenergy: 849.15873947 hartree
xcener: -85.615181584932 hartree
chargesum: 0.0000000
charge: -0.284904 -0.496509 0.076374 -0.221442 -0.113209 -0.177016 0.056163 -0.134675 -0.304254 -0.314841 -0.301843 -0.105636 -0.172221 0.000804 -0.260516 -0.208500 0.501841 0.036526 -0.417194 0.019755 0.045703 0.079157 0.080144 0.090907 0.068209 0.088252 0.071880 0.027770 0.098720 0.093452 0.089999 0.089661 0.085560 0.089441 0.093349 0.093603 0.091398 0.090878 0.085370 0.134014 0.119939 0.105696 0.113540 0.111464 0.120799 0.138370 0.140411 0.283610
qa: -0.2849 -0.4965 0.0764 -0.2214 -0.1132 -0.1770 0.0562 -0.1347 -0.3043 -0.3148 -0.3018 -0.1056 -0.1722 0.0008 -0.2605 -0.2085 0.5018 0.0365 -0.4172 0.0198 0.0457 0.0792 0.0801 0.0909 0.0682 0.0883 0.0719 0.0278 0.0987 0.0935 0.0900 0.0897 0.0856 0.0894 0.0933 0.0936 0.0914 0.0909 0.0854 0.1340 0.1199 0.1057 0.1135 0.1115 0.1208 0.1384 0.1404 0.2836
va: 2.1161 1.9906 3.7608 3.9752 3.8734 3.8502 3.8151 3.9002 3.9311 3.9283 3.9293 3.8498 3.8361 3.6579 3.9195 3.7557 4.0979 3.9008 3.6938 3.6586 1.0179 1.0052 1.0101 1.0074 1.0076 1.0133 1.0071 1.0197 1.0048 1.0108 1.0048 1.0048 1.0020 1.0005 1.0046 1.0048 1.0011 1.0043 1.0027 0.9943 1.0200 1.0265 0.9977 0.9940 1.0334 0.9895 0.9995 0.9480
dispcorr: -0.024380127 hartree
energy: -853.253451241112
dipole: -28.43448 27.08827 -1.34621 14.58359 -14.89937 -0.31578 0.46989 -1.00393 -0.53403
magnitude: 1.48229 au
magnitude: 3.76769 debye
