program: Orca
programVersion: 5.0.2
elementType: O O C C C C C C C C C C C C C C C C C C H H H H H H H H H H H H H H H H H H H H H H H H H H H H
charge: 0
multiplicity: 1
keywords: wb97x-d3
keywords: def2-TZVPP
keywords: def2/J RIJCOSX
keywords: DEFGRID2
keywords: scfconv7
keywords: smallprint printgap noloewdin
keywords: NOSOSCF
formula: C18H28O2
InChI: InChI=1/C18H28O2/c1-6-13-20-18(19)14-17(5)12-8-11-16(4)10-7-9-15(2)3/h1,8,12,14-16H,7,9-11,13H2,2-5H3
48 atoms
O  3.829999 -2.274433 1.199547
O  3.579209 -1.065874 -0.66388
C  -3.947476 0.092359 0.320978
C  -3.228125 1.283176 0.959805
C  -3.625607 2.649231 0.403827
C  -3.338182 2.843073 -1.086123
C  -1.903203 2.552138 -1.529544
C  -3.197656 -1.221337 0.588855
C  -5.387325 -0.012335 0.807334
C  -1.771394 2.723552 -3.03824
C  -0.888861 3.425162 -0.800292
C  -1.869776 -1.248832 -0.085593
C  -0.700743 -1.430933 0.537337
C  0.609889 -1.393427 -0.104159
C  0.661747 -1.076703 -1.564407
C  1.677226 -1.65674 0.681635
C  3.084037 -1.615774 0.294981
C  5.240625 -2.28356 1.00064
C  5.842652 -0.995542 1.318641
C  6.349478 0.054231 1.60806
H  -3.965683 0.230224 -0.766321
H  -3.417561 1.265452 2.038766
H  -2.146318 1.162724 0.852157
H  -4.69076 2.829032 0.577047
H  -3.103889 3.41921 0.97906
H  -3.584472 3.876478 -1.355784
H  -4.017504 2.217623 -1.673932
H  -1.674384 1.504362 -1.300222
H  -3.804063 -2.048601 0.202994
H  -3.086789 -1.382428 1.665445
H  -5.922068 -0.817613 0.300382
H  -5.422871 -0.214591 1.880543
H  -5.942431 0.909917 0.629153
H  -1.970155 3.755506 -3.338657
H  -2.473797 2.083224 -3.575625
H  -0.766529 2.469185 -3.381511
H  -1.089081 4.48581 -0.973203
H  -0.900477 3.260239 0.278312
H  0.126306 3.221738 -1.14691
H  -1.891447 -1.082316 -1.159138
H  -0.702361 -1.600106 1.610405
H  -0.015849 -1.731184 -2.11382
H  1.650553 -1.182836 -1.993965
H  0.32133 -0.05381 -1.741819
H  1.49249 -1.931408 1.713825
H  5.49773 -2.585682 -0.016622
H  5.623982 -3.047359 1.676545
H  6.799558 0.98877 1.859624
elementType: O C H
totalener: -853.23251847 hartree
nucrepener: 1509.00339507 hartree
electener: -2362.23591354 hartree
oneelecener: -4152.42939003 hartree
twoeener: 1790.19347649 hartree
cpcmener: -0.02703159 hartree
kineticenergy: 849.15445941 hartree
xcener: -85.613013408472 hartree
chargesum: 0.0000000
charge: -0.284194 -0.492351 0.039660 -0.151800 -0.182533 -0.178674 0.110036 -0.111350 -0.307345 -0.295398 -0.308133 -0.142019 -0.141544 0.026914 -0.260444 -0.188004 0.478530 0.036817 -0.427443 0.033548 0.052118 0.084685 0.075714 0.079696 0.082198 0.080340 0.079121 -0.022643 0.094956 0.080736 0.092465 0.082590 0.093603 0.086834 0.089216 0.089589 0.090119 0.088525 0.093449 0.123802 0.117904 0.107746 0.105268 0.111613 0.123666 0.138720 0.137553 0.286146
qa: -0.2842 -0.4924 0.0397 -0.1518 -0.1825 -0.1787 0.1100 -0.1114 -0.3073 -0.2954 -0.3081 -0.1420 -0.1415 0.0269 -0.2604 -0.1880 0.4785 0.0368 -0.4274 0.0335 0.0521 0.0847 0.0757 0.0797 0.0822 0.0803 0.0791 -0.0226 0.0950 0.0807 0.0925 0.0826 0.0936 0.0868 0.0892 0.0896 0.0901 0.0885 0.0934 0.1238 0.1179 0.1077 0.1053 0.1116 0.1237 0.1387 0.1376 0.2861
va: 2.1221 2.0034 3.7686 3.8574 3.9228 3.8883 3.7867 3.9091 3.9490 3.9180 3.9325 3.8836 3.8516 3.7323 3.9332 3.8016 4.1332 3.8979 3.7135 3.6359 1.0209 1.0123 1.0018 1.0083 1.0015 1.0112 1.0019 1.0260 1.0051 1.0158 1.0042 1.0024 1.0027 1.0042 1.0043 1.0051 1.0030 1.0011 1.0048 1.0016 1.0212 0.9957 1.0271 0.9929 1.0284 1.0001 0.9900 0.9456
dispcorr: -0.021751833 hartree
energy: -853.254270306572
dipole: -36.77641 35.41251 -1.36391 18.81050 -19.27947 -0.46898 -8.13433 8.51005 0.37573
magnitude: 1.49042 au
magnitude: 3.78835 debye
