program: Orca
programVersion: 5.0.2
elementType: O O C C C C C C C C C C C C C C C C C C H H H H H H H H H H H H H H H H H H H H H H H H H H H H
charge: 0
multiplicity: 1
keywords: wb97x-d3
keywords: def2-TZVPP
keywords: def2/J RIJCOSX
keywords: DEFGRID2
keywords: scfconv7
keywords: smallprint printgap noloewdin
keywords: NOSOSCF
formula: C18H28O2
InChI: InChI=1/C18H28O2/c1-6-13-20-18(19)14-17(5)12-8-11-16(4)10-7-9-15(2)3/h1,8,12,14-16H,7,9-11,13H2,2-5H3
48 atoms
O  3.281146 -1.3145 1.402034
O  2.923864 -1.29641 -0.803986
C  -4.315311 -0.036977 0.100348
C  -3.397453 1.098805 0.577282
C  -2.328089 1.542415 -0.418122
C  -1.415756 2.615183 0.170444
C  -0.1958 2.996447 -0.676337
C  -3.750236 -1.429479 0.444596
C  -5.70677 0.094361 0.709846
C  0.83222 1.870861 -0.754733
C  -0.584632 3.472794 -2.071355
C  -2.42162 -1.688746 -0.170268
C  -1.276471 -1.771915 0.516459
C  0.047857 -1.817436 -0.090243
C  0.139553 -2.041144 -1.56641
C  1.098478 -1.585417 0.728943
C  2.484402 -1.399428 0.321322
C  4.663712 -1.064233 1.170983
C  4.904407 0.294746 0.701795
C  5.122799 1.419015 0.340222
H  -4.415643 0.02876 -0.989555
H  -4.011536 1.972387 0.820823
H  -2.92185 0.803347 1.520178
H  -1.733678 0.685764 -0.741436
H  -2.822387 1.921702 -1.317663
H  -1.061212 2.278742 1.151178
H  -2.009173 3.516238 0.360445
H  0.284724 3.837578 -0.16429
H  -4.461408 -2.183338 0.09126
H  -3.688893 -1.527517 1.532445
H  -6.3644 -0.715379 0.388528
H  -5.660967 0.069063 1.801195
H  -6.176198 1.036269 0.422075
H  1.73561 2.200347 -1.271942
H  0.447548 1.006533 -1.299856
H  1.129144 1.53115 0.239777
H  -1.331786 4.268267 -2.030785
H  0.281747 3.863276 -2.608437
H  -0.998824 2.661918 -2.674196
H  -2.408116 -1.743005 -1.254992
H  -1.308397 -1.687975 1.599105
H  -0.593485 -2.780078 -1.886996
H  1.1186 -2.381273 -1.883184
H  -0.082897 -1.116685 -2.10507
H  0.905091 -1.468122 1.788758
H  5.08764 -1.789703 0.473451
H  5.149633 -1.212747 2.134833
H  5.312532 2.416898 0.012669
elementType: O C H
totalener: -853.23035526 hartree
nucrepener: 1566.91769962 hartree
electener: -2420.14805488 hartree
oneelecener: -4268.76287632 hartree
twoeener: 1848.61482145 hartree
cpcmener: -0.02776610 hartree
kineticenergy: 849.15816540 hartree
xcener: -85.613054581282 hartree
chargesum: 0.0000000
charge: -0.285582 -0.497161 0.083789 -0.183083 -0.138442 -0.156614 0.097643 -0.129074 -0.311833 -0.340090 -0.316499 -0.085980 -0.180053 0.027139 -0.274827 -0.207419 0.495551 0.040037 -0.416424 0.018181 0.045658 0.080417 0.069265 0.049914 0.078802 0.070935 0.081969 0.036946 0.090472 0.080287 0.089421 0.087978 0.090065 0.100837 0.069544 0.094578 0.093199 0.095256 0.081429 0.132104 0.116651 0.112503 0.109063 0.122546 0.119555 0.139927 0.138050 0.283368
qa: -0.2856 -0.4972 0.0838 -0.1831 -0.1384 -0.1566 0.0976 -0.1291 -0.3118 -0.3401 -0.3165 -0.0860 -0.1801 0.0271 -0.2748 -0.2074 0.4956 0.0400 -0.4164 0.0182 0.0457 0.0804 0.0693 0.0499 0.0788 0.0709 0.0820 0.0369 0.0905 0.0803 0.0894 0.0880 0.0901 0.1008 0.0695 0.0946 0.0932 0.0953 0.0814 0.1321 0.1167 0.1125 0.1091 0.1225 0.1196 0.1399 0.1381 0.2834
va: 2.1187 1.9860 3.7414 3.9036 3.8622 3.8778 3.8241 3.9435 3.9401 3.9812 3.9418 3.8416 3.8821 3.6817 3.9249 3.7896 4.0996 3.8993 3.6932 3.6589 1.0218 1.0056 1.0099 1.0096 1.0099 1.0115 1.0073 1.0124 1.0081 1.0123 1.0042 0.9997 1.0035 1.0076 0.9925 0.9966 1.0026 1.0046 0.9963 0.9999 1.0218 0.9990 1.0200 0.9885 1.0315 0.9993 0.9899 0.9481
dispcorr: -0.023783277 hartree
energy: -853.254138535356
dipole: -28.15643 26.84704 -1.30939 14.04781 -14.12082 -0.07301 -5.90362 6.43577 0.53215
magnitude: 1.41528 au
magnitude: 3.59735 debye
