program: Orca
programVersion: 5.0.2
elementType: O O C C C C C C C C C C C C C C C C C C H H H H H H H H H H H H H H H H H H H H H H H H H H H H
charge: 0
multiplicity: 1
keywords: wb97x-d3
keywords: def2-TZVPP
keywords: def2/J RIJCOSX
keywords: DEFGRID2
keywords: scfconv7
keywords: smallprint printgap noloewdin
keywords: NOSOSCF
formula: C18H28O2
InChI: InChI=1/C18H28O2/c1-6-13-20-18(19)14-17(5)12-8-11-16(4)10-7-9-15(2)3/h1,8,12,14-16H,7,9-11,13H2,2-5H3
48 atoms
O  3.321837 -1.3294 1.387246
O  2.94823 -1.286668 -0.814417
C  -4.33432 -0.047674 0.091348
C  -3.45369 1.122065 0.554433
C  -2.36846 1.558499 -0.426763
C  -1.483155 2.656778 0.156149
C  -0.232629 3.010384 -0.657212
C  -3.732017 -1.418137 0.460642
C  -5.731974 0.053113 0.69263
C  0.791443 1.878603 -0.668597
C  -0.570835 3.448814 -2.07763
C  -2.399131 -1.661156 -0.151686
C  -1.25134 -1.737262 0.531768
C  0.06921 -1.783555 -0.084025
C  0.141311 -1.992278 -1.563401
C  1.129796 -1.574078 0.728592
C  2.515315 -1.396498 0.31257
C  4.707983 -1.110306 1.143792
C  4.979315 0.237065 0.658164
C  5.209583 1.353728 0.280436
H  -4.431012 -0.001827 -0.99997
H  -4.092464 1.988639 0.755992
H  -2.996164 0.864543 1.517228
H  -1.755152 0.70304 -0.714596
H  -2.846055 1.908815 -1.346851
H  -1.1654 2.358181 1.161366
H  -2.08536 3.561973 0.290841
H  0.233481 3.863737 -0.152075
H  -4.424292 -2.195539 0.12048
H  -3.668956 -1.496662 1.550016
H  -6.363316 -0.782002 0.383757
H  -5.690419 0.048966 1.784437
H  -6.22844 0.974936 0.385801
H  1.720527 2.194668 -1.147046
H  0.427761 1.00812 -1.217939
H  1.038183 1.552483 0.344038
H  -1.31126 4.251528 -2.084426
H  0.316138 3.815602 -2.597512
H  -0.97337 2.624055 -2.669477
H  -2.38637 -1.717158 -1.236292
H  -1.278206 -1.653183 1.614529
H  1.132285 -2.259076 -1.909438
H  -0.16482 -1.084279 -2.088569
H  -0.546813 -2.780294 -1.867979
H  0.946607 -1.469477 1.7917
H  5.109531 -1.851897 0.44993
H  5.19762 -1.26176 2.10531
H  5.42223 2.334401 -0.083327
elementType: O C H
totalener: -853.23022909 hartree
nucrepener: 1564.79441945 hartree
electener: -2418.02464854 hartree
oneelecener: -4264.50568651 hartree
twoeener: 1846.48103797 hartree
cpcmener: -0.02767366 hartree
kineticenergy: 849.15687405 hartree
xcener: -85.613250334307 hartree
chargesum: -0.0000000
charge: -0.285662 -0.497428 0.084130 -0.184967 -0.129996 -0.157085 0.095878 -0.128545 -0.311185 -0.336729 -0.315801 -0.086928 -0.181798 0.026887 -0.273242 -0.212118 0.503445 0.039232 -0.413610 0.015078 0.045345 0.079888 0.068962 0.042666 0.078677 0.070877 0.081678 0.036831 0.091286 0.080457 0.089574 0.087726 0.090084 0.100252 0.067928 0.095723 0.092698 0.095260 0.081596 0.132500 0.116594 0.109482 0.118635 0.114593 0.119470 0.140136 0.138010 0.283517
qa: -0.2857 -0.4974 0.0841 -0.1850 -0.1300 -0.1571 0.0959 -0.1285 -0.3112 -0.3367 -0.3158 -0.0869 -0.1818 0.0269 -0.2732 -0.2121 0.5034 0.0392 -0.4136 0.0151 0.0453 0.0799 0.0690 0.0427 0.0787 0.0709 0.0817 0.0368 0.0913 0.0805 0.0896 0.0877 0.0901 0.1003 0.0679 0.0957 0.0927 0.0953 0.0816 0.1325 0.1166 0.1095 0.1186 0.1146 0.1195 0.1401 0.1380 0.2835
va: 2.1200 1.9856 3.7432 3.9092 3.8609 3.8790 3.8285 3.9414 3.9393 3.9794 3.9411 3.8417 3.8888 3.6773 3.9195 3.7849 4.0932 3.8991 3.6925 3.6621 1.0218 1.0057 1.0098 1.0134 1.0099 1.0113 1.0075 1.0122 1.0077 1.0126 1.0042 0.9998 1.0036 1.0078 0.9921 0.9971 1.0027 1.0045 0.9966 1.0000 1.0218 1.0238 0.9890 0.9983 1.0317 0.9987 0.9901 0.9481
dispcorr: -0.023686023 hartree
energy: -853.253915116311
dipole: -28.57490 27.25680 -1.31810 14.03014 -14.13382 -0.10369 -5.77778 6.29629 0.51852
magnitude: 1.42021 au
magnitude: 3.60989 debye
