program: Orca
programVersion: 5.0.2
elementType: O O C C C C C C C C C C C C C C C C C C H H H H H H H H H H H H H H H H H H H H H H H H H H H H
charge: 0
multiplicity: 1
keywords: wb97x-d3
keywords: def2-TZVPP
keywords: def2/J RIJCOSX
keywords: DEFGRID2
keywords: scfconv7
keywords: smallprint printgap noloewdin
keywords: NOSOSCF
formula: C18H28O2
InChI: InChI=1/C18H28O2/c1-6-13-20-18(19)14-17(5)12-8-11-16(4)10-7-9-15(2)3/h1,8,12,14-16H,7,9-11,13H2,2-5H3
48 atoms
O  3.51057 -1.58513 1.428703
O  3.169772 -1.461826 -0.775686
C  -4.396288 -0.1620 0.124343
C  -3.73516 1.187048 0.430952
C  -2.622625 1.61019 -0.523162
C  -2.01861 2.958911 -0.142527
C  -0.721997 3.323581 -0.8738
C  -3.572084 -1.362516 0.623092
C  -5.786878 -0.223117 0.747704
C  0.438937 2.420936 -0.466202
C  -0.895216 3.332862 -2.388461
C  -2.248578 -1.516374 -0.039099
C  -1.074479 -1.56013 0.601363
C  0.228767 -1.623488 -0.050204
C  0.255948 -1.711555 -1.542543
C  1.314715 -1.564848 0.75471
C  2.71371 -1.537513 0.34467
C  4.916034 -1.546468 1.204827
C  5.369549 -0.229685 0.775322
C  5.768405 0.85307 0.441949
H  -4.506805 -0.255935 -0.962815
H  -4.506974 1.964375 0.417782
H  -3.352022 1.168691 1.458277
H  -1.838599 0.852402 -0.539552
H  -3.023788 1.652266 -1.540343
H  -1.819216 2.967042 0.934817
H  -2.761213 3.745003 -0.315816
H  -0.46384 4.342618 -0.564982
H  -4.154886 -2.270102 0.426881
H  -3.44894 -1.295578 1.708298
H  -5.736086 -0.105873 1.832894
H  -6.427036 0.571199 0.361052
H  -6.279399 -1.175224 0.541995
H  1.373785 2.754233 -0.920774
H  0.281796 1.385598 -0.778149
H  0.582771 2.419739 0.616206
H  0.002985 3.706138 -2.883853
H  -1.085706 2.33064 -2.778234
H  -1.727758 3.969758 -2.694228
H  -2.275811 -1.580088 -1.123125
H  -1.066754 -1.486338 1.685059
H  -0.430355 -2.483294 -1.891145
H  1.237541 -1.930831 -1.943202
H  -0.083477 -0.768182 -1.977191
H  1.149272 -1.518728 1.824714
H  5.223996 -2.308862 0.486018
H  5.368616 -1.797583 2.16362
H  6.128432 1.809241 0.134363
elementType: O C H
totalener: -853.23074155 hartree
nucrepener: 1532.98894665 hartree
electener: -2386.21968820 hartree
oneelecener: -4200.72984253 hartree
twoeener: 1814.51015434 hartree
cpcmener: -0.02728618 hartree
kineticenergy: 849.15800436 hartree
xcener: -85.613248812723 hartree
chargesum: -0.0000000
charge: -0.285479 -0.496977 0.089407 -0.185073 -0.079184 -0.169478 0.075915 -0.123987 -0.307192 -0.289797 -0.312570 -0.107720 -0.155201 -0.002226 -0.262312 -0.192607 0.500852 0.033595 -0.426677 0.029940 0.040733 0.074991 0.068366 0.007676 0.074638 0.070223 0.079298 0.036658 0.094990 0.080850 0.086533 0.089739 0.090007 0.097868 0.047285 0.093638 0.094816 0.079713 0.092492 0.134172 0.114757 0.111539 0.109917 0.113606 0.117739 0.140246 0.138550 0.285730
qa: -0.2855 -0.4970 0.0894 -0.1851 -0.0792 -0.1695 0.0759 -0.1240 -0.3072 -0.2898 -0.3126 -0.1077 -0.1552 -0.0022 -0.2623 -0.1926 0.5009 0.0336 -0.4267 0.0299 0.0407 0.0750 0.0684 0.0077 0.0746 0.0702 0.0793 0.0367 0.0950 0.0809 0.0865 0.0897 0.0900 0.0979 0.0473 0.0936 0.0948 0.0797 0.0925 0.1342 0.1148 0.1115 0.1099 0.1136 0.1177 0.1402 0.1385 0.2857
va: 2.1215 1.9991 3.7559 3.9281 3.8299 3.9095 3.8287 3.9256 3.9336 3.9461 3.9425 3.8723 3.8872 3.6964 3.9146 3.7676 4.1267 3.9027 3.7045 3.6460 1.0230 1.0068 1.0093 1.0404 1.0099 1.0102 1.0087 1.0127 1.0052 1.0144 1.0002 1.0045 1.0045 1.0070 1.0005 1.0048 1.0047 0.9974 1.0031 1.0006 1.0223 0.9973 1.0294 0.9900 1.0321 0.9988 0.9898 0.9461
dispcorr: -0.022011296 hartree
energy: -853.252752847586
dipole: -31.47174 30.06317 -1.40857 15.60014 -15.70850 -0.10836 -6.33492 6.86441 0.52948
magnitude: 1.50869 au
magnitude: 3.83479 debye
