program: Orca
programVersion: 5.0.2
elementType: O O C C C C C C C C C C C C C C C C C C H H H H H H H H H H H H H H H H H H H H H H H H H H H H
charge: 0
multiplicity: 1
keywords: wb97x-d3
keywords: def2-TZVPP
keywords: def2/J RIJCOSX
keywords: DEFGRID2
keywords: scfconv7
keywords: smallprint printgap noloewdin
keywords: NOSOSCF
formula: C18H28O2
InChI: InChI=1/C18H28O2/c1-6-13-20-18(19)14-17(5)12-8-11-16(4)10-7-9-15(2)3/h1,8,12,14-16H,7,9-11,13H2,2-5H3
48 atoms
O  3.724959 -0.437068 1.269796
O  3.401297 -1.377784 -0.731151
C  -4.376918 -0.430103 0.24212
C  -3.991728 1.049235 0.349133
C  -2.955182 1.539384 -0.656713
C  -2.627285 3.018323 -0.475197
C  -1.407137 3.514902 -1.258632
C  -3.321348 -1.37896 0.835729
C  -5.706707 -0.676846 0.947358
C  -0.108583 2.895268 -0.74955
C  -1.55736 3.301961 -2.760986
C  -2.016166 -1.405069 0.120418
C  -0.82732 -1.215367 0.703912
C  0.456109 -1.23705 0.012024
C  0.444783 -1.497632 -1.459988
C  1.553695 -0.98137 0.759505
C  2.942281 -0.96961 0.313124
C  5.124683 -0.386234 1.012108
C  5.744914 -1.700357 1.117426
C  6.280416 -2.770215 1.223372
H  -4.501375 -0.681019 -0.818415
H  -4.898179 1.652134 0.225644
H  -3.638513 1.249554 1.367733
H  -2.041905 0.951368 -0.562595
H  -3.328302 1.359523 -1.669583
H  -2.456272 3.216718 0.588672
H  -3.501158 3.616294 -0.75529
H  -1.341382 4.594577 -1.083956
H  -3.735388 -2.393739 0.801385
H  -3.169235 -1.140453 1.892901
H  -6.010554 -1.72287 0.8782
H  -5.640036 -0.422513 2.007992
H  -6.503597 -0.070924 0.51379
H  0.009884 3.043766 0.325773
H  0.757874 3.34273 -1.240155
H  -0.064772 1.819991 -0.939199
H  -0.738377 3.772945 -3.30794
H  -1.550873 2.241354 -3.021661
H  -2.49016 3.728333 -3.135836
H  -2.069481 -1.603451 -0.94639
H  -0.793373 -1.011865 1.770406
H  1.42624 -1.4514 -1.9147
H  -0.19535 -0.767854 -1.959581
H  0.019734 -2.480855 -1.669106
H  1.408288 -0.753856 1.809152
H  5.536025 0.278289 1.771125
H  5.334804 0.058699 0.037411
H  6.740202 -3.728194 1.321741
elementType: O C H
totalener: -853.23094133 hartree
nucrepener: 1512.35650335 hartree
electener: -2365.58744469 hartree
oneelecener: -4159.25427547 hartree
twoeener: 1793.66683078 hartree
cpcmener: -0.02682074 hartree
kineticenergy: 849.15993800 hartree
xcener: -85.612990337491 hartree
chargesum: -0.0000000
charge: -0.284832 -0.494711 0.091300 -0.184683 -0.077655 -0.170520 0.074710 -0.118163 -0.306433 -0.294355 -0.312312 -0.115254 -0.151444 -0.006941 -0.254670 -0.188182 0.492509 0.034778 -0.427369 0.033357 0.039771 0.074078 0.067678 0.006767 0.074392 0.070734 0.078986 0.036633 0.095290 0.080807 0.090622 0.085436 0.089648 0.093240 0.097232 0.056227 0.094676 0.079839 0.091909 0.134687 0.114482 0.107325 0.101688 0.115858 0.120052 0.138116 0.139052 0.285645
qa: -0.2848 -0.4947 0.0913 -0.1847 -0.0777 -0.1705 0.0747 -0.1182 -0.3064 -0.2944 -0.3123 -0.1153 -0.1514 -0.0069 -0.2547 -0.1882 0.4925 0.0348 -0.4274 0.0334 0.0398 0.0741 0.0677 0.0068 0.0744 0.0707 0.0790 0.0366 0.0953 0.0808 0.0906 0.0854 0.0896 0.0932 0.0972 0.0562 0.0947 0.0798 0.0919 0.1347 0.1145 0.1073 0.1017 0.1159 0.1201 0.1381 0.1391 0.2856
va: 2.1203 2.0031 3.7624 3.9303 3.8286 3.9108 3.8265 3.9152 3.9317 3.9460 3.9419 3.8800 3.8853 3.7128 3.9196 3.7716 4.1298 3.9015 3.7150 3.6371 1.0228 1.0070 1.0097 1.0439 1.0096 1.0098 1.0088 1.0123 1.0040 1.0147 1.0045 1.0006 1.0050 1.0044 1.0058 0.9973 1.0046 0.9971 1.0030 1.0009 1.0225 1.0311 0.9926 0.9967 1.0311 0.9898 1.0003 0.9459
dispcorr: -0.021358022 hartree
energy: -853.252299354659
dipole: -35.01757 33.57411 -1.44346 16.03341 -15.57193 0.46148 -7.62240 8.07410 0.45171
magnitude: 1.58132 au
magnitude: 4.01941 debye
