program: Orca
programVersion: 5.0.2
elementType: O O C C C C C C C C C C C C C C C C C C H H H H H H H H H H H H H H H H H H H H H H H H H H H H
charge: 0
multiplicity: 1
keywords: wb97x-d3
keywords: def2-TZVPP
keywords: def2/J RIJCOSX
keywords: DEFGRID2
keywords: scfconv7
keywords: smallprint printgap noloewdin
keywords: NOSOSCF
formula: C18H28O2
InChI: InChI=1/C18H28O2/c1-6-13-20-18(19)14-17(5)12-8-11-16(4)10-7-9-15(2)3/h1,8,12,14-16H,7,9-11,13H2,2-5H3
48 atoms
O  3.842101 -0.759769 1.426554
O  3.540914 -1.114278 -0.760131
C  -4.329729 -0.308446 0.176331
C  -4.220133 1.098761 0.77175
C  -2.955037 1.897149 0.469101
C  -2.723272 2.157489 -1.014271
C  -1.415576 2.882779 -1.333696
C  -3.213351 -1.258472 0.639498
C  -5.686041 -0.902712 0.545073
C  -1.194978 2.938645 -2.840675
C  -1.373149 4.285637 -0.737529
C  -1.901538 -1.09636 -0.051018
C  -0.721581 -1.032145 0.576053
C  0.580339 -0.946193 -0.074987
C  0.608265 -0.840156 -1.565908
C  1.66213 -0.958394 0.736845
C  3.066924 -0.95439 0.34368
C  5.252832 -0.76932 1.231533
C  5.762929 -2.115477 1.002668
C  6.197273 -3.222099 0.831847
H  -4.284315 -0.240292 -0.916392
H  -5.084978 1.677093 0.428384
H  -4.330505 1.015369 1.858692
H  -3.031372 2.85032 0.999541
H  -2.081644 1.392739 0.889777
H  -3.563139 2.736963 -1.417852
H  -2.728473 1.207678 -1.5579
H  -0.596358 2.299298 -0.89422
H  -3.548067 -2.28303 0.434887
H  -3.085977 -1.190215 1.724345
H  -6.503552 -0.251697 0.230828
H  -5.838735 -1.875373 0.074355
H  -5.773408 -1.041285 1.625545
H  -1.184467 1.939096 -3.280411
H  -0.2467 3.418321 -3.090048
H  -1.989382 3.506264 -3.332086
H  -2.211848 4.886514 -1.099115
H  -1.420766 4.275059 0.351907
H  -0.454021 4.805114 -1.015049
H  -1.94162 -1.073475 -1.136571
H  -0.709912 -1.061093 1.66209
H  0.208722 -1.748334 -2.021015
H  1.599812 -0.671027 -1.967177
H  -0.032674 -0.018471 -1.891698
H  1.489706 -0.989843 1.806419
H  5.675575 -0.366321 2.151423
H  5.547073 -0.105701 0.415768
H  6.576834 -4.209808 0.691961
elementType: O C H
totalener: -853.23160890 hartree
nucrepener: 1510.11136119 hartree
electener: -2363.34297009 hartree
oneelecener: -4154.61641109 hartree
twoeener: 1791.27344100 hartree
cpcmener: -0.02703518 hartree
kineticenergy: 849.14927704 hartree
xcener: -85.611054180818 hartree
chargesum: -0.0000000
charge: -0.284149 -0.495937 0.086761 -0.225804 -0.111962 -0.182397 0.052350 -0.119213 -0.307499 -0.292876 -0.303026 -0.131193 -0.158782 0.011610 -0.236809 -0.188505 0.484691 0.035644 -0.427345 0.032555 0.049668 0.077708 0.078299 0.087711 0.075135 0.085399 0.073064 0.021440 0.097622 0.085617 0.089514 0.090333 0.085931 0.087278 0.091546 0.088332 0.084933 0.091431 0.091145 0.126594 0.117782 0.116585 0.105697 0.081446 0.119260 0.137533 0.138882 0.286001
qa: -0.2841 -0.4959 0.0868 -0.2258 -0.1120 -0.1824 0.0523 -0.1192 -0.3075 -0.2929 -0.3030 -0.1312 -0.1588 0.0116 -0.2368 -0.1885 0.4847 0.0356 -0.4273 0.0326 0.0497 0.0777 0.0783 0.0877 0.0751 0.0854 0.0731 0.0214 0.0976 0.0856 0.0895 0.0903 0.0859 0.0873 0.0915 0.0883 0.0849 0.0914 0.0911 0.1266 0.1178 0.1166 0.1057 0.0814 0.1193 0.1375 0.1389 0.2860
va: 2.1212 2.0028 3.7292 3.9661 3.8351 3.8500 3.8244 3.8845 3.9325 3.9176 3.9370 3.8603 3.8570 3.7225 3.9264 3.7858 4.1383 3.9016 3.7108 3.6363 1.0168 1.0064 1.0101 1.0094 1.0071 1.0129 1.0065 1.0154 1.0006 1.0144 1.0045 1.0044 1.0015 1.0014 1.0051 1.0028 1.0025 1.0012 1.0040 1.0010 1.0213 0.9977 1.0304 0.9978 1.0316 0.9895 0.9999 0.9456
dispcorr: -0.021666672 hartree
energy: -853.253275568862
dipole: -36.88971 35.49523 -1.39448 17.75175 -17.49090 0.26085 -7.63757 8.20275 0.56518
magnitude: 1.52710 au
magnitude: 3.88159 debye
