program: Orca
programVersion: 5.0.2
elementType: O O C C C C C C C C C C C C C C C C C C H H H H H H H H H H H H H H H H H H H H H H H H H H H H
charge: 0
multiplicity: 1
keywords: wb97x-d3
keywords: def2-TZVPP
keywords: def2/J RIJCOSX
keywords: DEFGRID2
keywords: scfconv7
keywords: smallprint printgap noloewdin
keywords: NOSOSCF
formula: C18H28O2
InChI: InChI=1/C18H28O2/c1-6-13-20-18(19)14-17(5)12-8-11-16(4)10-7-9-15(2)3/h1,8,12,14-16H,7,9-11,13H2,2-5H3
48 atoms
O  3.803495 -0.553991 1.369301
O  3.51214 -1.214465 -0.747692
C  -4.295467 -0.214783 0.274165
C  -4.06968 1.157785 0.91699
C  -2.839497 1.948315 0.476735
C  -2.855221 2.33984 -0.996696
C  -1.689681 3.234376 -1.422747
C  -3.241876 -1.254713 0.692221
C  -5.684434 -0.72406 0.647542
C  -0.365267 2.478184 -1.42587
C  -1.952824 3.840327 -2.797021
C  -1.93532 -1.165424 -0.018832
C  -0.747188 -1.085465 0.590308
C  0.550829 -1.062001 -0.073892
C  0.581184 -1.207136 -1.560934
C  1.632212 -0.916578 0.725443
C  3.034821 -0.919249 0.326283
C  5.213132 -0.53683 1.172665
C  5.774482 -1.881588 1.140843
C  6.259646 -2.980261 1.143386
H  -4.261298 -0.113621 -0.816469
H  -4.955255 1.773245 0.723353
H  -4.035697 1.02057 2.003624
H  -2.7966 2.864016 1.075696
H  -1.929761 1.395427 0.715424
H  -3.797545 2.860308 -1.203355
H  -2.861118 1.446165 -1.631677
H  -1.613256 4.056093 -0.700258
H  -3.650074 -2.248542 0.472164
H  -3.092379 -1.216708 1.775625
H  -5.774344 -0.867091 1.727252
H  -6.459445 -0.018494 0.343936
H  -5.90202 -1.680374 0.168896
H  -0.38247 1.68005 -2.172159
H  -0.140394 2.023966 -0.459443
H  0.4674 3.138649 -1.675316
H  -2.063631 3.060175 -3.554393
H  -2.866519 4.437753 -2.803038
H  -1.133362 4.488874 -3.112931
H  -1.990775 -1.200461 -1.103286
H  -0.725022 -1.034906 1.675387
H  0.298315 -2.223624 -1.842634
H  1.551005 -0.994927 -1.9940
H  -0.146935 -0.541841 -2.024238
H  1.460645 -0.790227 1.787974
H  5.618211 0.011043 2.023004
H  5.48358 0.01238 0.268503
H  6.677268 -3.962313 1.129122
elementType: O C H
totalener: -853.23126299 hartree
nucrepener: 1514.53279627 hartree
electener: -2367.76405926 hartree
oneelecener: -4163.55774087 hartree
twoeener: 1795.79368161 hartree
cpcmener: -0.02711765 hartree
kineticenergy: 849.15643733 hartree
xcener: -85.612046494561 hartree
chargesum: 0.0000000
charge: -0.283833 -0.495447 0.074791 -0.209403 -0.124061 -0.175650 0.094375 -0.115127 -0.303782 -0.335659 -0.296794 -0.123130 -0.148057 -0.011221 -0.273907 -0.175959 0.486728 0.034474 -0.427348 0.032707 0.049899 0.077266 0.080408 0.081278 0.072227 0.078399 0.067132 0.025038 0.097420 0.082666 0.086190 0.088948 0.089959 0.086148 0.090282 0.102430 0.081659 0.088003 0.089420 0.126361 0.119202 0.126470 0.109889 0.097650 0.118567 0.138316 0.139495 0.285578
qa: -0.2838 -0.4954 0.0748 -0.2094 -0.1241 -0.1757 0.0944 -0.1151 -0.3038 -0.3357 -0.2968 -0.1231 -0.1481 -0.0112 -0.2739 -0.1760 0.4867 0.0345 -0.4273 0.0327 0.0499 0.0773 0.0804 0.0813 0.0722 0.0784 0.0671 0.0250 0.0974 0.0827 0.0862 0.0889 0.0900 0.0861 0.0903 0.1024 0.0817 0.0880 0.0894 0.1264 0.1192 0.1265 0.1099 0.0977 0.1186 0.1383 0.1395 0.2856
va: 2.1207 2.0036 3.7332 3.9463 3.8561 3.8680 3.7925 3.8902 3.9316 3.9479 3.9284 3.8582 3.8382 3.7082 3.9226 3.7739 4.1369 3.8991 3.7144 3.6387 1.0195 1.0053 1.0113 1.0133 1.0075 1.0109 1.0118 1.0194 1.0010 1.0160 1.0008 1.0051 1.0045 0.9939 0.9983 1.0074 1.0020 1.0050 1.0053 1.0031 1.0215 0.9954 1.0246 0.9946 1.0317 0.9897 1.0002 0.9459
dispcorr: -0.022056875 hartree
energy: -853.253319864651
dipole: -36.31764 34.89112 -1.42652 16.10001 -15.71460 0.38541 -8.47220 9.00420 0.53200
magnitude: 1.57052 au
magnitude: 3.99194 debye
