program: Orca
programVersion: 5.0.2
elementType: O O C C C C C C C C C C C C C C C C C C H H H H H H H H H H H H H H H H H H H H H H H H H H H H
charge: 0
multiplicity: 1
keywords: wb97x-d3
keywords: def2-TZVPP
keywords: def2/J RIJCOSX
keywords: DEFGRID2
keywords: scfconv7
keywords: smallprint printgap noloewdin
keywords: NOSOSCF
formula: C18H28O2
InChI: InChI=1/C18H28O2/c1-6-13-20-18(19)14-17(5)12-8-11-16(4)10-7-9-15(2)3/h1,8,12,14-16H,7,9-11,13H2,2-5H3
48 atoms
O  3.495569 -2.010121 -1.034101
O  3.300763 -1.473411 1.126412
C  -3.595411 -0.345828 -1.204125
C  -2.944234 1.035791 -1.055971
C  -3.409327 1.851192 0.14511
C  -2.787635 3.244257 0.217316
C  -1.259764 3.290932 0.314047
C  -3.517016 -1.185619 0.07669
C  -5.049463 -0.243091 -1.652614
C  -0.787924 4.737172 0.415818
C  -0.730403 2.474546 1.488199
C  -2.158179 -1.365686 0.678107
C  -1.01358 -1.455081 -0.009474
C  0.315098 -1.575587 0.582186
C  0.419124 -1.594548 2.073251
C  1.355755 -1.645023 -0.278855
C  2.774808 -1.692916 0.057169
C  4.911317 -2.060932 -0.886344
C  5.497473 -0.732258 -0.766222
C  5.9814 0.364013 -0.689189
H  -3.050442 -0.874059 -1.993933
H  -1.859565 0.913676 -1.008188
H  -3.135113 1.605696 -1.971984
H  -4.497528 1.961991 0.120467
H  -3.189248 1.310618 1.070498
H  -3.203497 3.768118 1.085671
H  -3.099885 3.821029 -0.660258
H  -0.838914 2.870334 -0.60587
H  -3.939708 -2.177276 -0.125943
H  -4.174245 -0.753655 0.835604
H  -5.48321 -1.230988 -1.818876
H  -5.668835 0.262054 -0.90872
H  -5.134405 0.314413 -2.586885
H  -1.15353 5.205356 1.333249
H  -1.146263 5.336124 -0.423811
H  0.301649 4.802609 0.424981
H  -0.958573 1.411722 1.389377
H  0.354559 2.564173 1.570552
H  -1.161909 2.817534 2.432228
H  -2.132907 -1.431528 1.760836
H  -1.040134 -1.402959 -1.093813
H  -0.277506 -2.320969 2.492106
H  0.141583 -0.619849 2.480692
H  1.411557 -1.83792 2.431601
H  1.135521 -1.660348 -1.33993
H  5.279948 -2.544732 -1.790208
H  5.200563 -2.684952 -0.038191
H  6.418323 1.334606 -0.61294
elementType: O C H
totalener: -853.22967677 hartree
nucrepener: 1523.32496831 hartree
electener: -2376.55464507 hartree
oneelecener: -4181.27299263 hartree
twoeener: 1804.71834756 hartree
cpcmener: -0.02671451 hartree
kineticenergy: 849.14744158 hartree
xcener: -85.614561954640 hartree
chargesum: -0.0000000
charge: -0.284799 -0.494679 0.089488 -0.189176 -0.138448 -0.203751 0.088359 -0.139526 -0.323863 -0.305067 -0.279545 -0.113480 -0.170233 -0.004171 -0.265338 -0.170806 0.481171 0.037618 -0.426440 0.030137 0.045342 0.091256 0.083225 0.087554 0.075722 0.075735 0.074494 0.032462 0.099285 0.092849 0.093762 0.084279 0.092047 0.081620 0.088630 0.089917 0.040452 0.094850 0.090028 0.135507 0.120778 0.106012 0.116201 0.106646 0.121016 0.138056 0.138687 0.286138
qa: -0.2848 -0.4947 0.0895 -0.1892 -0.1384 -0.2038 0.0884 -0.1395 -0.3239 -0.3051 -0.2795 -0.1135 -0.1702 -0.0042 -0.2653 -0.1708 0.4812 0.0376 -0.4264 0.0301 0.0453 0.0913 0.0832 0.0876 0.0757 0.0757 0.0745 0.0325 0.0993 0.0928 0.0938 0.0843 0.0920 0.0816 0.0886 0.0899 0.0405 0.0949 0.0900 0.1355 0.1208 0.1060 0.1162 0.1066 0.1210 0.1381 0.1387 0.2861
va: 2.1217 2.0026 3.8049 3.8678 3.8503 3.9264 3.7756 3.9090 3.9463 3.9335 3.9319 3.8635 3.8284 3.7155 3.9307 3.7882 4.1379 3.8978 3.7115 3.6415 1.0120 0.9968 1.0123 1.0101 0.9978 1.0101 1.0093 1.0162 1.0046 0.9986 1.0035 1.0003 1.0040 1.0036 1.0040 1.0045 1.0168 1.0059 1.0055 0.9967 1.0187 0.9967 0.9911 1.0264 1.0301 0.9897 1.0000 0.9457
dispcorr: -0.021819148 hartree
energy: -853.251495914456
dipole: -32.78731 31.40270 -1.38462 19.19327 -19.50765 -0.31438 2.48854 -3.08062 -0.59208
magnitude: 1.53836 au
magnitude: 3.91020 debye
