program: Orca
programVersion: 5.0.2
elementType: O O C C C C C C C C C C C C C C C C C C H H H H H H H H H H H H H H H H H H H H H H H H H H H H
charge: 0
multiplicity: 1
keywords: wb97x-d3
keywords: def2-TZVPP
keywords: def2/J RIJCOSX
keywords: DEFGRID2
keywords: scfconv7
keywords: smallprint printgap noloewdin
keywords: NOSOSCF
formula: C18H28O2
InChI: InChI=1/C18H28O2/c1-6-13-20-18(19)14-17(5)12-8-11-16(4)10-7-9-15(2)3/h1,8,12,14-16H,7,9-11,13H2,2-5H3
48 atoms
O  3.133256 -1.194629 1.267667
O  2.810079 -1.366719 -0.937044
C  -4.32826 0.049879 0.143369
C  -3.281508 1.051595 0.651718
C  -2.263355 1.507614 -0.394914
C  -1.004771 2.087989 0.23918
C  -0.008096 2.719585 -0.734379
C  -3.863058 -1.408994 0.341301
C  -5.664836 0.239694 0.851062
C  1.176517 3.300818 0.030067
C  0.482815 1.735575 -1.790371
C  -2.547798 -1.692717 -0.293418
C  -1.400592 -1.789096 0.388316
C  -0.078311 -1.843413 -0.221362
C  0.006923 -2.098534 -1.692201
C  0.971142 -1.585391 0.592294
C  2.356321 -1.393247 0.18693
C  4.490969 -0.834152 1.02908
C  4.597718 0.52685 0.517107
C  4.672822 1.655878 0.11359
H  -4.483286 0.21779 -0.928711
H  -3.787214 1.937737 1.046949
H  -2.757607 0.610619 1.507825
H  -1.992651 0.672501 -1.043921
H  -2.730221 2.25302 -1.047932
H  -0.497235 1.294559 0.802292
H  -1.294155 2.842275 0.979403
H  -0.518454 3.542042 -1.24996
H  -4.623625 -2.075196 -0.076788
H  -3.808921 -1.610462 1.415249
H  -5.556324 0.116236 1.93115
H  -6.066347 1.238253 0.672288
H  -6.408381 -0.48259 0.509366
H  1.719112 2.515225 0.562679
H  0.855903 4.038337 0.768484
H  1.884893 3.791477 -0.640346
H  1.198483 2.210683 -2.464212
H  0.988317 0.884158 -1.32787
H  -0.329526 1.346352 -2.405382
H  -2.540822 -1.742958 -1.378165
H  -1.428564 -1.707797 1.471257
H  -0.703892 -2.870758 -1.984979
H  0.994463 -2.408375 -2.012781
H  -0.256859 -1.195264 -2.248559
H  0.773241 -1.437153 1.647443
H  4.979701 -1.538083 0.35259
H  4.987445 -0.907832 1.995945
H  4.744101 2.659602 -0.243072
elementType: O C H
totalener: -853.23092879 hartree
nucrepener: 1591.98581289 hartree
electener: -2445.21674168 hartree
oneelecener: -4318.86518166 hartree
twoeener: 1873.64843998 hartree
cpcmener: -0.02660366 hartree
kineticenergy: 849.16082414 hartree
xcener: -85.613403110461 hartree
chargesum: 0.0000000
charge: -0.285538 -0.498055 0.076392 -0.189420 -0.122285 -0.203074 0.124151 -0.133676 -0.314872 -0.311901 -0.296639 -0.073894 -0.192281 0.027372 -0.273024 -0.207954 0.499881 0.050500 -0.394824 -0.011399 0.050612 0.084148 0.071092 0.067707 0.084227 0.061353 0.084080 0.028204 0.090213 0.081259 0.087908 0.090168 0.089350 0.066763 0.092562 0.096381 0.102927 0.029207 0.097850 0.132811 0.119849 0.113506 0.110234 0.116043 0.119817 0.138848 0.138747 0.284676
qa: -0.2855 -0.4981 0.0764 -0.1894 -0.1223 -0.2031 0.1242 -0.1337 -0.3149 -0.3119 -0.2966 -0.0739 -0.1923 0.0274 -0.2730 -0.2080 0.4999 0.0505 -0.3948 -0.0114 0.0506 0.0841 0.0711 0.0677 0.0842 0.0614 0.0841 0.0282 0.0902 0.0813 0.0879 0.0902 0.0893 0.0668 0.0926 0.0964 0.1029 0.0292 0.0979 0.1328 0.1198 0.1135 0.1102 0.1160 0.1198 0.1388 0.1387 0.2847
va: 2.1188 1.9866 3.7513 3.8836 3.8364 3.9050 3.7579 3.9396 3.9483 3.9477 3.9300 3.8145 3.8922 3.6461 3.9148 3.7673 4.0992 3.8892 3.6961 3.6895 1.0203 1.0061 1.0100 1.0054 1.0118 1.0058 1.0124 1.0191 1.0093 1.0110 0.9995 1.0036 1.0044 1.0018 1.0092 1.0009 1.0099 1.0221 0.9993 0.9986 1.0199 1.0000 1.0241 0.9938 1.0319 1.0013 0.9895 0.9481
dispcorr: -0.025131381 hartree
energy: -853.256060173567
dipole: -24.91564 23.52263 -1.39301 13.26825 -13.20031 0.06794 -3.30475 3.80135 0.49660
magnitude: 1.48044 au
magnitude: 3.76298 debye
