program: Orca
programVersion: 5.0.2
elementType: O O C C C C C C C C C C C C C C C C C C H H H H H H H H H H H H H H H H H H H H H H H H H H H H
charge: 0
multiplicity: 1
keywords: wb97x-d3
keywords: def2-TZVPP
keywords: def2/J RIJCOSX
keywords: DEFGRID2
keywords: scfconv7
keywords: smallprint printgap noloewdin
keywords: NOSOSCF
formula: C18H28O2
InChI: InChI=1/C18H28O2/c1-6-13-20-18(19)14-17(5)12-8-11-16(4)10-7-9-15(2)3/h1,8,12,14-16H,7,9-11,13H2,2-5H3
48 atoms
O  3.893638 -0.890835 1.560612
O  3.660535 -1.169002 -0.642573
C  -4.203337 -0.241803 0.250024
C  -3.938884 1.091409 0.958701
C  -2.815488 1.966808 0.405949
C  -3.087707 2.497883 -0.997389
C  -2.05912 3.509682 -1.505871
C  -3.140063 -1.309735 0.554414
C  -5.57263 -0.775936 0.660576
C  -0.679016 2.886394 -1.682849
C  -2.529754 4.135865 -2.813464
C  -1.807996 -1.116908 -0.086562
C  -0.642303 -1.166733 0.568543
C  0.680802 -1.068313 -0.040086
C  0.757065 -0.952413 -1.528445
C  1.73747 -1.08925 0.802913
C  3.155026 -1.053614 0.449553
C  5.308201 -0.874461 1.410177
C  5.84934 -2.206182 1.170212
C  6.312658 -3.301153 1.000521
H  -4.222133 -0.07895 -0.833672
H  -4.862678 1.680367 0.937009
H  -3.746986 0.88334 2.017467
H  -2.690149 2.820154 1.081302
H  -1.867551 1.426641 0.432943
H  -4.077532 2.969157 -1.00369
H  -3.147014 1.669716 -1.713346
H  -1.977219 4.309942 -0.759813
H  -3.525968 -2.270238 0.190185
H  -3.027184 -1.417565 1.637923
H  -5.806914 -1.714482 0.15429
H  -5.61782 -0.963087 1.73671
H  -6.36483 -0.06546 0.418271
H  -0.28249 2.479505 -0.751468
H  0.043383 3.62104 -2.0449
H  -0.71029 2.073825 -2.414281
H  -1.821231 4.881677 -3.179943
H  -2.641566 3.37995 -3.595282
H  -3.49553 4.631891 -2.695625
H  -1.81959 -0.971657 -1.163471
H  -0.660765 -1.300422 1.646807
H  0.150945 -0.112337 -1.872336
H  0.347416 -1.848606 -1.998983
H  1.765785 -0.810631 -1.896926
H  1.534838 -1.142671 1.866492
H  5.695469 -0.484636 2.35175
H  5.617969 -0.188567 0.618393
H  6.720267 -4.275925 0.85042
elementType: O C H
totalener: -853.24416097 hartree
nucrepener: 1494.71771359 hartree
electener: -2347.96187456 hartree
oneelecener: -4123.84101176 hartree
twoeener: 1775.87913720 hartree
cpcmener: -0.02215041 hartree
kineticenergy: 849.14168051 hartree
xcener: -85.607071292515 hartree
chargesum: -0.0000000
charge: -0.279622 -0.466750 0.064688 -0.198820 -0.109474 -0.174810 0.083621 -0.114553 -0.301544 -0.324254 -0.292214 -0.130263 -0.144092 0.011819 -0.255790 -0.183300 0.468255 0.029503 -0.418963 0.035472 0.049176 0.076139 0.080406 0.082702 0.058117 0.074566 0.065918 0.025855 0.094788 0.080115 0.089130 0.085835 0.088824 0.093326 0.099168 0.083148 0.089160 0.080064 0.087324 0.125321 0.110108 0.090104 0.114881 0.108718 0.116050 0.134619 0.136265 0.281262
qa: -0.2796 -0.4667 0.0647 -0.1988 -0.1095 -0.1748 0.0836 -0.1146 -0.3015 -0.3243 -0.2922 -0.1303 -0.1441 0.0118 -0.2558 -0.1833 0.4683 0.0295 -0.4190 0.0355 0.0492 0.0761 0.0804 0.0827 0.0581 0.0746 0.0659 0.0259 0.0948 0.0801 0.0891 0.0858 0.0888 0.0933 0.0992 0.0831 0.0892 0.0801 0.0873 0.1253 0.1101 0.0901 0.1149 0.1087 0.1161 0.1346 0.1363 0.2813
va: 2.1235 2.0378 3.7519 3.9445 3.8598 3.8670 3.8027 3.8966 3.9313 3.9364 3.9297 3.8797 3.8914 3.7079 3.9214 3.7751 4.1659 3.9147 3.7196 3.6416 1.0194 1.0048 1.0113 1.0116 1.0171 1.0123 1.0122 1.0191 1.0023 1.0166 1.0048 1.0010 1.0053 0.9983 1.0079 0.9969 1.0054 1.0032 1.0052 1.0037 1.0238 0.9956 0.9981 1.0328 1.0319 0.9891 1.0003 0.9487
dispcorr: -0.021062054 hartree
energy: -853.265223026035
dipole: -37.86148 36.54079 -1.32068 18.19691 -17.87761 0.31931 -9.30943 9.81959 0.51016
magnitude: 1.45135 au
magnitude: 3.68905 debye
