program: Orca
programVersion: 5.0.2
elementType: O O C C C C C C C C C C C C C C C C C C H H H H H H H H H H H H H H H H H H H H H H H H H H H H
charge: 0
multiplicity: 1
keywords: wb97x-d3
keywords: def2-TZVPP
keywords: def2/J RIJCOSX
keywords: DEFGRID2
keywords: scfconv7
keywords: smallprint printgap noloewdin
keywords: NOSOSCF
formula: C18H28O2
InChI: InChI=1/C18H28O2/c1-6-13-20-18(19)14-17(5)12-8-11-16(4)10-7-9-15(2)3/h1,8,12,14-16H,7,9-11,13H2,2-5H3
48 atoms
O  3.875576 -2.426637 1.578229
O  3.594101 -2.328622 -0.634245
C  -3.753566 -0.127918 0.006676
C  -2.87295 1.103979 0.221646
C  -3.305705 2.340692 -0.558444
C  -2.333017 3.501322 -0.38191
C  -2.719303 4.79036 -1.110141
C  -3.113657 -1.382604 0.624394
C  -5.156032 0.063188 0.571913
C  -1.75183 5.91225 -0.748649
C  -2.772067 4.604724 -2.622914
C  -1.812225 -1.740732 -0.00611
C  -0.647263 -1.81468 0.646405
C  0.645622 -2.11106 0.035947
C  0.671267 -2.398427 -1.431255
C  1.720422 -2.096383 0.854706
C  3.118266 -2.294125 0.476503
C  5.275802 -2.596579 1.389379
C  5.927424 -1.361802 0.971292
C  6.468229 -0.339346 0.650914
H  -3.840817 -0.299212 -1.073919
H  -2.835787 1.334272 1.293484
H  -1.844627 0.863741 -0.067706
H  -3.386621 2.075396 -1.61729
H  -4.304927 2.662141 -0.247396
H  -1.334701 3.191807 -0.715282
H  -2.237148 3.718286 0.68794
H  -3.71966 5.084711 -0.769297
H  -3.806796 -2.221096 0.490977
H  -2.989791 -1.244057 1.703037
H  -5.12353 0.248177 1.648761
H  -5.67349 0.904623 0.109479
H  -5.773032 -0.822772 0.40912
H  -0.733609 5.672555 -1.066262
H  -1.725998 6.089787 0.328558
H  -2.030501 6.852492 -1.229067
H  -3.52464 3.875971 -2.926975
H  -3.0133 5.542697 -3.127451
H  -1.808186 4.263262 -3.01053
H  -1.847998 -1.931144 -1.075479
H  -0.636173 -1.611746 1.713851
H  1.643728 -2.710868 -1.791482
H  0.371009 -1.512945 -1.995756
H  -0.048051 -3.182839 -1.671583
H  1.552688 -1.910607 1.909521
H  5.487453 -3.398292 0.678133
H  5.663132 -2.907771 2.359622
H  6.947298 0.569653 0.363198
elementType: O C H
totalener: -853.24796913 hartree
nucrepener: 1438.20333096 hartree
electener: -2291.45130009 hartree
oneelecener: -4010.94276750 hartree
twoeener: 1719.49146741 hartree
cpcmener: -0.02213460 hartree
kineticenergy: 849.15030135 hartree
xcener: -85.606867463888 hartree
chargesum: -0.0000000
charge: -0.279717 -0.466040 0.088696 -0.175005 -0.122685 -0.159059 0.075207 -0.116920 -0.318121 -0.296084 -0.305043 -0.129256 -0.153490 0.023286 -0.261989 -0.181144 0.468142 0.029296 -0.418610 0.034356 0.039300 0.068393 0.076662 0.064823 0.064922 0.065228 0.068782 0.025696 0.095556 0.079890 0.084820 0.093001 0.091502 0.080101 0.087563 0.089566 0.089686 0.090659 0.082436 0.123208 0.111930 0.106281 0.110196 0.103235 0.117365 0.137047 0.134936 0.281395
qa: -0.2797 -0.4660 0.0887 -0.1750 -0.1227 -0.1591 0.0752 -0.1169 -0.3181 -0.2961 -0.3050 -0.1293 -0.1535 0.0233 -0.2620 -0.1811 0.4681 0.0293 -0.4186 0.0344 0.0393 0.0684 0.0767 0.0648 0.0649 0.0652 0.0688 0.0257 0.0956 0.0799 0.0848 0.0930 0.0915 0.0801 0.0876 0.0896 0.0897 0.0907 0.0824 0.1232 0.1119 0.1063 0.1102 0.1032 0.1174 0.1370 0.1349 0.2814
va: 2.1246 2.0371 3.7713 3.8980 3.8756 3.8870 3.8168 3.9114 3.9457 3.9315 3.9281 3.8756 3.9053 3.7209 3.9293 3.7843 4.1616 3.9124 3.7136 3.6442 1.0226 1.0134 1.0100 1.0096 1.0110 1.0122 1.0117 1.0183 1.0059 1.0152 1.0013 1.0025 1.0045 1.0034 1.0048 1.0050 1.0023 1.0046 1.0027 1.0055 1.0235 1.0303 0.9953 0.9961 1.0306 0.9992 0.9894 0.9488
dispcorr: -0.018431778 hartree
energy: -853.266400908235
dipole: -38.10846 36.79418 -1.31427 27.12781 -27.14514 -0.01732 -8.27400 8.77427 0.50027
magnitude: 1.40637 au
magnitude: 3.57471 debye
