program: Orca
programVersion: 5.0.2
elementType: O O C C C C C C C C C C C C C C C C C C H H H H H H H H H H H H H H H H H H H H H H H H H H H H
charge: 0
multiplicity: 1
keywords: wb97x-d3
keywords: def2-TZVPP
keywords: def2/J RIJCOSX
keywords: DEFGRID2
keywords: scfconv7
keywords: smallprint printgap noloewdin
keywords: NOSOSCF
formula: C18H28O2
InChI: InChI=1/C18H28O2/c1-6-13-20-18(19)14-17(5)12-8-11-16(4)10-7-9-15(2)3/h1,8,12,14-16H,7,9-11,13H2,2-5H3
48 atoms
O  3.663802 -2.146037 1.352313
O  3.337397 -1.585251 -0.784347
C  -4.327281 -0.247833 0.207621
C  -3.784202 1.168836 0.424651
C  -2.682631 1.615693 -0.531589
C  -2.292682 3.075739 -0.327912
C  -1.056561 3.51888 -1.112585
C  -3.391405 -1.35303 0.723158
C  -5.686814 -0.3958 0.883872
C  -1.244946 3.374079 -2.618734
C  -0.684728 4.953656 -0.75688
C  -2.083667 -1.462282 0.017506
C  -0.897783 -1.553897 0.629692
C  0.392658 -1.649198 -0.044618
C  0.399084 -1.62786 -1.539874
C  1.486193 -1.748877 0.743399
C  2.880711 -1.812144 0.312312
C  5.06656 -2.194874 1.118833
C  5.638571 -0.860116 0.99303
C  6.116761 0.238566 0.914546
H  -4.467587 -0.40081 -0.869882
H  -4.619302 1.871654 0.327565
H  -3.436268 1.264235 1.460184
H  -1.793235 0.993712 -0.404362
H  -3.021041 1.457259 -1.560229
H  -2.106728 3.245593 0.738602
H  -3.138701 3.721874 -0.592313
H  -0.223138 2.871237 -0.813071
H  -3.913493 -2.30982 0.596255
H  -3.232162 -1.230571 1.799153
H  -5.61112 -0.229551 1.961477
H  -6.405682 0.325204 0.490917
H  -6.105383 -1.392924 0.733787
H  -2.106995 3.951145 -2.964731
H  -1.400886 2.336739 -2.919345
H  -0.369533 3.736071 -3.16203
H  0.225804 5.269578 -1.270282
H  -1.478637 5.649769 -1.039904
H  -0.513145 5.069939 0.315364
H  -2.136477 -1.486321 -1.06751
H  -0.86853 -1.532059 1.715653
H  0.022284 -0.670148 -1.906447
H  -0.267562 -2.398215 -1.930944
H  1.381498 -1.785909 -1.967639
H  1.336691 -1.790096 1.816492
H  5.303983 -2.796717 0.23869
H  5.48929 -2.701081 1.986826
H  6.553004 1.20987 0.844789
elementType: O C H
totalener: -853.24561220 hartree
nucrepener: 1484.19370018 hartree
electener: -2337.43931238 hartree
oneelecener: -4102.93110930 hartree
twoeener: 1765.49179692 hartree
cpcmener: -0.02211807 hartree
kineticenergy: 849.14846373 hartree
xcener: -85.607182944606 hartree
chargesum: -0.0000000
charge: -0.279799 -0.467478 0.083750 -0.177409 -0.093019 -0.172707 0.075596 -0.117864 -0.300295 -0.302839 -0.295819 -0.142898 -0.144144 0.018642 -0.256645 -0.186974 0.467488 0.032816 -0.418972 0.032352 0.038404 0.073004 0.068107 0.046075 0.071024 0.068071 0.068333 0.026863 0.095202 0.080092 0.085642 0.088983 0.089560 0.083442 0.087358 0.091510 0.089719 0.079581 0.087705 0.129806 0.110264 0.105460 0.103246 0.108795 0.117302 0.136210 0.135048 0.281411
qa: -0.2798 -0.4675 0.0837 -0.1774 -0.0930 -0.1727 0.0756 -0.1179 -0.3003 -0.3028 -0.2958 -0.1429 -0.1441 0.0186 -0.2566 -0.1870 0.4675 0.0328 -0.4190 0.0324 0.0384 0.0730 0.0681 0.0461 0.0710 0.0681 0.0683 0.0269 0.0952 0.0801 0.0856 0.0890 0.0896 0.0834 0.0874 0.0915 0.0897 0.0796 0.0877 0.1298 0.1103 0.1055 0.1032 0.1088 0.1173 0.1362 0.1350 0.2814
va: 2.1241 2.0355 3.7773 3.9243 3.8477 3.9016 3.8117 3.9113 3.9337 3.9309 3.9365 3.9093 3.8977 3.7276 3.9265 3.7841 4.1632 3.9105 3.7199 3.6476 1.0226 1.0069 1.0108 1.0278 1.0092 1.0116 1.0117 1.0190 1.0038 1.0149 1.0009 1.0052 1.0048 1.0028 1.0027 1.0049 1.0049 1.0035 1.0046 1.0003 1.0236 0.9958 0.9962 1.0311 1.0311 1.0005 0.9893 0.9488
dispcorr: -0.019682071 hartree
energy: -853.265294269385
dipole: -34.60559 33.32684 -1.27875 20.89135 -21.16433 -0.27298 -7.16675 7.65648 0.48972
magnitude: 1.39626 au
magnitude: 3.54900 debye
