program: Orca
programVersion: 5.0.2
elementType: O O C C C C C C C C C C C C C C C C C C H H H H H H H H H H H H H H H H H H H H H H H H H H H H
charge: 0
multiplicity: 1
keywords: wb97x-d3
keywords: def2-TZVPP
keywords: def2/J RIJCOSX
keywords: DEFGRID2
keywords: scfconv7
keywords: smallprint printgap noloewdin
keywords: NOSOSCF
formula: C18H28O2
InChI: InChI=1/C18H28O2/c1-6-13-20-18(19)14-17(5)12-8-11-16(4)10-7-9-15(2)3/h1,8,12,14-16H,7,9-11,13H2,2-5H3
48 atoms
O  4.055816 -2.654586 -0.270093
O  4.187053 -0.726803 0.851436
C  -3.485313 -0.438595 -0.210393
C  -3.644087 1.083857 -0.206556
C  -4.120024 1.664875 -1.534046
C  -4.371259 3.170984 -1.495963
C  -3.188283 4.041542 -1.064182
C  -2.711999 -0.934957 1.025559
C  -4.830753 -1.152185 -0.281131
C  -1.951636 3.803256 -1.92247
C  -3.585146 5.513358 -1.093749
C  -1.295827 -0.464916 1.073384
C  -0.252054 -1.243168 0.766336
C  1.148672 -0.830454 0.781116
C  1.454016 0.579657 1.172571
C  2.057937 -1.761649 0.418781
C  3.512023 -1.611883 0.379767
C  5.474539 -2.698477 -0.369778
C  6.089262 -3.125798 0.880584
C  6.600403 -3.51063 1.896681
H  -2.900591 -0.72021 -1.094756
H  -4.339986 1.36725 0.592835
H  -2.687382 1.546107 0.051209
H  -3.387572 1.426257 -2.311874
H  -5.048871 1.178208 -1.844082
H  -5.21318 3.369417 -0.823366
H  -4.699977 3.496257 -2.489913
H  -2.932994 3.790641 -0.028303
H  -2.730241 -2.028003 1.035967
H  -3.238578 -0.599792 1.926092
H  -4.702816 -2.236138 -0.306985
H  -5.447259 -0.914244 0.589552
H  -5.3976 -0.876174 -1.171049
H  -1.585619 2.777952 -1.845855
H  -1.132081 4.459246 -1.621803
H  -2.159286 4.00018 -2.977771
H  -2.780002 6.153253 -0.726913
H  -3.82521 5.838207 -2.109537
H  -4.462919 5.704569 -0.472581
H  -1.130567 0.56919 1.358167
H  -0.440821 -2.27662 0.487688
H  0.897702 1.272362 0.538532
H  2.505925 0.827821 1.100779
H  1.132144 0.766017 2.199063
H  1.692277 -2.736494 0.116595
H  5.884149 -1.738363 -0.690742
H  5.689328 -3.425389 -1.153246
H  7.055452 -3.837529 2.804996
elementType: O C H
totalener: -853.24565935 hartree
nucrepener: 1445.96527590 hartree
electener: -2299.21093525 hartree
oneelecener: -4026.22390376 hartree
twoeener: 1727.01296851 hartree
cpcmener: -0.02216047 hartree
kineticenergy: 849.14451657 hartree
xcener: -85.606873999633 hartree
chargesum: -0.0000000
charge: -0.278466 -0.465756 0.089772 -0.176146 -0.131398 -0.193803 0.073179 -0.125631 -0.312002 -0.304251 -0.297936 -0.134330 -0.142033 0.010659 -0.260146 -0.175246 0.462454 0.030827 -0.420904 0.037773 0.042756 0.074948 0.067688 0.071042 0.082498 0.074287 0.075738 0.032791 0.083984 0.093560 0.091571 0.083688 0.091864 0.083083 0.091796 0.086768 0.089798 0.081116 0.087723 0.129192 0.110989 0.101474 0.106638 0.108513 0.117458 0.136244 0.135278 0.280900
qa: -0.2785 -0.4658 0.0898 -0.1761 -0.1314 -0.1938 0.0732 -0.1256 -0.3120 -0.3043 -0.2979 -0.1343 -0.1420 0.0107 -0.2601 -0.1752 0.4625 0.0308 -0.4209 0.0378 0.0428 0.0749 0.0677 0.0710 0.0825 0.0743 0.0757 0.0328 0.0840 0.0936 0.0916 0.0837 0.0919 0.0831 0.0918 0.0868 0.0898 0.0811 0.0877 0.1292 0.1110 0.1015 0.1066 0.1085 0.1175 0.1362 0.1353 0.2809
va: 2.1257 2.0381 3.7934 3.8968 3.8668 3.9062 3.7810 3.9175 3.9450 3.9357 3.9311 3.8909 3.9118 3.7245 3.9315 3.7785 4.1669 3.9116 3.7257 3.6370 1.0237 1.0115 1.0086 1.0030 1.0147 1.0089 1.0106 1.0140 1.0142 1.0064 1.0043 1.0019 1.0044 1.0017 1.0053 1.0030 1.0046 1.0042 1.0043 0.9947 1.0235 0.9957 1.0318 0.9961 1.0309 1.0013 0.9890 0.9490
dispcorr: -0.019131306 hartree
energy: -853.264790659115
dipole: -42.54011 41.23498 -1.30512 25.58571 -25.77836 -0.19265 -8.59241 8.20815 -0.38426
magnitude: 1.37409 au
magnitude: 3.49265 debye
