program: Orca
programVersion: 5.0.2
elementType: O O C C C C C C C C C C C C C C C C C C H H H H H H H H H H H H H H H H H H H H H H H H H H H H
charge: 0
multiplicity: 1
keywords: wb97x-d3
keywords: def2-TZVPP
keywords: def2/J RIJCOSX
keywords: DEFGRID2
keywords: scfconv7
keywords: smallprint printgap noloewdin
keywords: NOSOSCF
formula: C18H28O2
InChI: InChI=1/C18H28O2/c1-6-13-20-18(19)14-17(5)12-8-11-16(4)10-7-9-15(2)3/h1,8,12,14-16H,7,9-11,13H2,2-5H3
48 atoms
O  3.509878 -1.483745 -0.937988
O  3.236353 -2.725541 0.897731
C  -3.594298 -0.212385 -0.513444
C  -3.072393 0.97026 0.310577
C  -2.668937 2.182131 -0.520519
C  -2.140992 3.324984 0.338521
C  -1.741286 4.585969 -0.43033
C  -3.544006 -1.511259 0.290005
C  -5.019593 0.038392 -0.995672
C  -1.339432 5.690176 0.541145
C  -0.617259 4.324622 -1.427369
C  -2.196222 -2.073127 0.608357
C  -1.028015 -1.692801 0.078898
C  0.27658 -2.249125 0.428243
C  0.32694 -3.339591 1.449853
C  1.348427 -1.716392 -0.199885
C  2.753021 -2.056228 0.014258
C  4.913421 -1.708235 -0.875857
C  5.548495 -0.970399 0.208936
C  6.102201 -0.350835 1.075887
H  -2.959811 -0.327131 -1.400397
H  -3.840904 1.257963 1.037953
H  -2.205951 0.658398 0.901169
H  -1.906242 1.869508 -1.2404
H  -3.518562 2.539382 -1.111945
H  -1.277655 2.973559 0.917148
H  -2.90686 3.593478 1.074811
H  -2.618443 4.932205 -0.990784
H  -4.105892 -2.295047 -0.234435
H  -4.085067 -1.374157 1.234171
H  -5.370185 -0.76583 -1.645506
H  -5.711911 0.106081 -0.152419
H  -5.100147 0.968565 -1.560301
H  -0.463817 5.398416 1.127355
H  -2.142439 5.920606 1.244424
H  -1.088062 6.61463 0.017147
H  -0.897777 3.596489 -2.189562
H  -0.333469 5.240571 -1.949826
H  0.275451 3.945872 -0.921964
H  -2.209805 -2.876141 1.338942
H  -1.008674 -0.891904 -0.653549
H  1.293888 -3.824343 1.510421
H  -0.419497 -4.103498 1.230779
H  0.09058 -2.939831 2.438608
H  1.17154 -0.948215 -0.944106
H  5.304289 -1.36263 -1.832985
H  5.142048 -2.773419 -0.79299
H  6.57282 0.197234 1.861552
elementType: O C H
totalener: -853.24569460 hartree
nucrepener: 1467.42671604 hartree
electener: -2320.67241064 hartree
oneelecener: -4069.36915470 hartree
twoeener: 1748.69674405 hartree
cpcmener: -0.02248411 hartree
kineticenergy: 849.14063937 hartree
xcener: -85.607607175967 hartree
chargesum: -0.0000000
charge: -0.280587 -0.466193 0.108085 -0.216292 -0.108696 -0.165302 0.078506 -0.125617 -0.307996 -0.298151 -0.306011 -0.113423 -0.137092 -0.018263 -0.272421 -0.154784 0.456941 0.027187 -0.418417 0.035036 0.033026 0.078483 0.090366 0.062153 0.066785 0.067462 0.068468 0.026514 0.091616 0.085612 0.092116 0.083353 0.091508 0.080637 0.087557 0.089665 0.089213 0.091071 0.083326 0.123987 0.106614 0.105919 0.101024 0.116048 0.117607 0.134788 0.137627 0.280945
qa: -0.2806 -0.4662 0.1081 -0.2163 -0.1087 -0.1653 0.0785 -0.1256 -0.3080 -0.2982 -0.3060 -0.1134 -0.1371 -0.0183 -0.2724 -0.1548 0.4569 0.0272 -0.4184 0.0350 0.0330 0.0785 0.0904 0.0622 0.0668 0.0675 0.0685 0.0265 0.0916 0.0856 0.0921 0.0834 0.0915 0.0806 0.0876 0.0897 0.0892 0.0911 0.0833 0.1240 0.1066 0.1059 0.1010 0.1160 0.1176 0.1348 0.1376 0.2809
va: 2.1217 2.0380 3.7622 3.8925 3.8468 3.8892 3.8147 3.9563 3.9372 3.9322 3.9286 3.8990 3.8464 3.7555 3.9382 3.7773 4.1675 3.9171 3.7167 3.6455 1.0183 1.0135 1.0015 1.0115 1.0131 1.0103 1.0122 1.0180 1.0037 1.0051 1.0040 1.0033 1.0031 1.0033 1.0047 1.0050 1.0025 1.0046 1.0024 1.0050 1.0253 1.0264 0.9966 0.9937 1.0296 0.9894 0.9989 0.9491
dispcorr: -0.018885724 hartree
energy: -853.264580327789
dipole: -32.57038 31.21306 -1.35732 23.98236 -23.75458 0.22779 -1.79604 1.23283 -0.56321
magnitude: 1.48709 au
magnitude: 3.77987 debye
